Bicyclo[4.1.0]heptan-3-one, 4,7,7-trimethyl-, [1R-(1α,4α,6α)]-

Gas phase ion energetics data

Data compiled by: Henry M. Rosenstock, Keith Draxl, Bruce W. Steiner, and John T. Herron

Ionization energy determinations

IE (eV) Method Reference
9.74EIBunau, Schade, et al., 1967

Appearance energy determinations

Ion AE (eV) Other Products MethodReferenceComment
C9H13O+10.5CH3EIBunau, Schade, et al., 1967

Van Den Dool and Kratz RI, non-polar column, temperature ramp

View large format table.

Column type Active phase I Reference Comment
CapillaryHP-5MS1197.Kallio, Jussila, et al., 200620. m/0.25 mm/0.25 μm, 60. C @ 4. min, 5. K/min, 240. C @ 15. min

References

Bunau, Schade, et al., 1967
Bunau, G.v.; Schade, G.; Gollnick, K., Massenspektrometrische Untersuchungen von Terpenen. I.Monoterpenaldehyde und -ketone, Z. Anal. Chem., 1967, 227, 173. [all data]

Kallio, Jussila, et al., 2006
Kallio, M.; Jussila, M.; Rissanen, T.; Anttila, P.; Hartonen, K.; Reissell, A.; Vreuls, R.; Adahchour, M.; Hyotylainen, T., Comprehensive two-dimensional gas chromatography coupled to time-of-flight mass spectrometry in the identification of organic compounds in atmospheric aerosols from coniferous forest, J. Chromatogr. A, 2006, 1125, 2, 234-243, https://doi.org/10.1016/j.chroma.2006.05.050 . [all data]