2H-1-Benzopyran, 3,4,4a,5,6,8a-hexahydro-2,5,5,8a-tetramethyl-, (2α,4aα,8aα)-

Normal alkane RI, non-polar column, temperature ramp

View large format table.

Column type Active phase I Reference Comment
CapillaryHP-5MS1318.Ferhat, Tigrine-Kordjani, et al., 200730. m/0.25 mm/0.25 μm, He, 60. C @ 8. min, 2. K/min, 250. C @ 15. min
CapillaryHP-5 MS1318.Tigrine-Kordiani, Meklati, et al., 200630. m/0.25 mm/0.25 μm, Helium, 60. C @ 8. min, 2. K/min, 250. C @ 15. min
CapillaryHP-51296.0Leffingwell and Alford, 200560. m/0.32 mm/0.25 μm, He, 30. C @ 2. min, 2. K/min, 260. C @ 28. min

Normal alkane RI, polar column, temperature ramp

View large format table.

Column type Active phase I Reference Comment
CapillaryCarbowax-PEG1569.Tigrine-Kordiani, Meklati, et al., 200660. m/0.20 mm/0.25 μm, Helium, 60. C @ 8. min, 2. K/min, 250. C @ 15. min

References

Ferhat, Tigrine-Kordjani, et al., 2007
Ferhat, M.A.; Tigrine-Kordjani, N.; Chemat, S.; Meklati, B.Y.; Chemat, F., Rapid Extraction of Volatile Compounds Using a New Simultaneous Microwave Distillation: Solvent Extraction Device, Chromatographia, 2007, 65, 3-4, 217-222, https://doi.org/10.1365/s10337-006-0130-5 . [all data]

Tigrine-Kordiani, Meklati, et al., 2006
Tigrine-Kordiani, N.; Meklati, B.Y.; Chemat, F., Abalysis by gas chromatography - mass spectrometry of the essential oil of Zygophyllum album L., an aromatic and medicinal plant growing in Algeria, Int. J. Aromatherapy, 2006, 16, 3-4, 187-191, https://doi.org/10.1016/j.ijat.2006.09.008 . [all data]

Leffingwell and Alford, 2005
Leffingwell, J.C.; Alford, E.D., Volatile constituents of Perique tobacco, Electron. J. Environ. Agric. Food Chem., 2005, 4, 2, 899-915. [all data]