diethyl 1,1-cyclopentanedicarboxylate

Phase change data

Data compiled as indicated in comments:
BS - Robert L. Brown and Stephen E. Stein
AC - William E. Acree, Jr., James S. Chickos

Reduced pressure boiling point

Tboil (K) Pressure (atm) Reference Comment
482.70.983Weast and Grasselli, 1989BS

Enthalpy of vaporization

ΔvapH (kcal/mol) Temperature (K) Method Reference Comment
16.0 ± 0.1293. - 323.GSVerevkin, Kümmerlin, et al., 1998AC

References

Weast and Grasselli, 1989
CRC Handbook of Data on Organic Compounds, 2nd Editon, Weast,R.C and Grasselli, J.G., ed(s)., CRC Press, Inc., Boca Raton, FL, 1989, 1. [all data]

Verevkin, Kümmerlin, et al., 1998
Verevkin, S.P.; Kümmerlin, M.; Beckhaus, H.-D.; Galli, C.; Rüchardt, C., Geminal substituent effects, 16 - Do alkoxycarbonyl substituents stabilize small cycloalkane rings?, Eur. J. Org. Chem., 1998, 4, 579. [all data]