Morpholine, 4-nitro-

Phase change data

Data compiled by: Hussein Y. Afeefy, Joel F. Liebman, and Stephen E. Stein

Enthalpy of sublimation

ΔsubH (kcal/mol) Temperature (K) Method Reference
19.5 ± 0.1288.VGolovanova, Sitonina, et al., 1988

References

Golovanova, Sitonina, et al., 1988
Golovanova, O.F.; Sitonina, G.V.; Pepekin, v.I.; Korsunskii, B.L.; Dubovitskii, F.I., Kinetic and thermochemical studies of N-nitro and N-nitrosomorpholine, Bull. Acad. Sci. USSR, Div. Chem. Sci., 1988, 881-886. [all data]