Ruthenium,tricarbonyl[(1,2,3,4-η)-1,3-cycloheptadiene]-

Gas phase ion energetics data

Data compiled by: Sharon G. Lias, Rhoda D. Levin, and Sherif A. Kafafi

Ionization energy determinations

IE (eV) Method Reference Comment
7.96PEGreen, Powell, et al., 1976Vertical value

References

Green, Powell, et al., 1976
Green, J.C.; Powell, P.; Van Tilborg, J., He(I) photoelectron spectra of tricarbonyl-iron and -ruthenium complexes of cyclic dienes, and of tricarbonylcycloheptatriene- and tricarbonylcyclooctatetraene-iron, J. Chem. Soc. Dalton Trans., 1976, 1974. [all data]