PbF3

Gas phase ion energetics data

Data compiled by: John E. Bartmess

Electron affinity determinations

EA (eV) Method Reference Comment
3.69996EIAEBennett, Wang, et al., 1975From PbF4
4.336412EIAEFranklin, Wang, et al., 1974From PbF4
4.766932N/ACheck, Faust, et al., 2001MnF2-(t); ; ΔS(EA)=4.4

References

Bennett, Wang, et al., 1975
Bennett, S.L.; Wang, J.L.; Margrave, J.L.; Franklin, J.L., High temperature negative ions. The enthalpies of formation of gaseous PbF3 and SnF3 from low-energy electron impact studies, High Temp. Sci., 1975, 7, 142. [all data]

Franklin, Wang, et al., 1974
Franklin, J.L.; Wang, J.L.-F.; Bennett, S.L.; Harland, P.W.; Margrave, J.L., Studies of the energies of negative ions at high temperatures, Adv. Mass Spectrom., 1974, 6, 319. [all data]

Check, Faust, et al., 2001
Check, C.E.; Faust, T.O.; Bailey, J.M.; Wright, B.J.; Gilbert, T.M.; Sunderlin, L.S., Addition of Polarization and Diffuse Functions to the LANL2DZ Basis Set for P-Block Elements, J. Phys. Chem. A,, 2001, 105, 34, 8111, https://doi.org/10.1021/jp011945l . [all data]