2,2'-[[4-[(2,4-dinitrophenyl)azo]-3-methylphenyl]imino]bisethanol

Phase change data

Data compiled by: Thermodynamics Research Center, NIST Boulder Laboratories, Chris Muzny director

Quantity Value Units Method Reference Comment
Tfus463.KN/ABaughman and Perenich, 1988Uncertainty assigned by TRC = 1. K

In addition to the Thermodynamics Research Center (TRC) data available from this site, much more physical and chemical property data is available from the following TRC products:

References

Baughman and Perenich, 1988
Baughman, G.L.; Perenich, T.A., Fate of dyes in aquatic systems: I. Solubility and partitioning of some hydrophobic dyes and related compounds, Environ. Tox. Chem., 1988, 7, 3, 183, https://doi.org/10.1002/etc.5620070302 . [all data]