1,2,3,5,5 And 1,2,4,5,5-pentamethylcyclopentadiene mixture

Gas phase ion energetics data

Data compiled by: Henry M. Rosenstock, Keith Draxl, Bruce W. Steiner, and John T. Herron

Ionization energy determinations

IE (eV) Method Reference
7.77 ± 0.05EIMeyer and Harrison, 1964

References

Meyer and Harrison, 1964
Meyer, F.; Harrison, A.G., Ionization potentials of methyl-substituted benzenes and cyclopentadienes, Can. J. Chem., 1964, 42, 2256. [all data]