2-Butenoic acid, 2-methyl-, 3-methylbutyl ester, (E)-

Van Den Dool and Kratz RI, non-polar column, temperature ramp

Data compiled by: NIST Mass Spectrometry Data Center, William E. Wallace, director

Column type CapillaryCapillary
Active phase DB-1CP Sil 5 CB
Column length (m) 60.25.
Carrier gas HeN2
Substrate
Column diameter (mm) 0.250.22
Phase thickness (μm) 0.25
Tstart (C) 40.70.
Tend (C) 280.295.
Heat rate (K/min) 4.4.
Initial hold (min) 5.
Final hold (min)
I 1126.1168.
ReferenceOmidbaigi, Sefidkon, et al., 2004Montanarella, Bos, et al., 1986
Comment MSDC-RI MSDC-RI

References

Omidbaigi, Sefidkon, et al., 2004
Omidbaigi, R.; Sefidkon, F.; Kazemi, F., Influence of drying methods on the essential oil content and composition of Roman chamomile, Flavour Fragr. J., 2004, 19, 3, 196-198, https://doi.org/10.1002/ffj.1340 . [all data]

Montanarella, Bos, et al., 1986
Montanarella, L.; Bos, R.; Fischer, F.C., The Essential Oil in Lamina and Petiole of Heracleum dissectum Leaves, Planta Medica, 1986, 52, 04, 332-334, https://doi.org/10.1055/s-2007-969171 . [all data]