Phenylboron dibromide

Phase change data

Data compiled by: William E. Acree, Jr., James S. Chickos

Enthalpy of vaporization

ΔvapH (kcal/mol) Temperature (K) Method Reference Comment
10.5 ± 0.50412.TFinch, Gardner, et al., 1967Based on data from 391. - 433. K.

References

Finch, Gardner, et al., 1967
Finch, Arthur; Gardner, P.J.; Watts, G.B., Thermochemistry of the trialkylthioboranes and triphenylthioborane, Trans. Faraday Soc., 1967, 63, 1603, https://doi.org/10.1039/tf9676301603 . [all data]