1,1'-Biphenyl, 2,3',4',6-tetrachloro-

Kovats' RI, non-polar column, isothermal

View large format table.

Column type Active phase Temperature (C) I Reference Comment
CapillaryApiezon L200.2032.Krupcík, Leclercq, et al., 1980N2; Column length: 50. m; Column diameter: 0.25 mm

Normal alkane RI, non-polar column, custom temperature program

View large format table.

Column type Active phase I Reference Comment
CapillaryApolane2005.Bush, Murphy, et al., 1985He; Column length: 50. m; Column diameter: 0.25 mm; Program: 70 0C (2 min) 10 0C/min (6 min) 2 0C/min -> 250 0C

References

Krupcík, Leclercq, et al., 1980
Krupcík, J.; Leclercq, P.A.; Garaj, J.; Símová, A., Analysis of alkylated mixtures of polychlorinated biphenyls by capillary gas chromatography-mass spectrometry, J. Chromatogr., 1980, 191, 207-220, https://doi.org/10.1016/S0021-9673(00)86381-5 . [all data]

Bush, Murphy, et al., 1985
Bush, B.; Murphy, M.J.; Connor, S.; Snow, J.; Barnard, E., Improvements in Glass Capillary Gas Chromatographic Polychlorobiphenyl Analysis, J. Chromatogr. Sci., 1985, 23, 11, 509-515, https://doi.org/10.1093/chromsci/23.11.509 . [all data]