1,1'-Biphenyl, 2,2',5,6'-Tetrachloro-

Phase change data

Data compiled by: William E. Acree, Jr., James S. Chickos

Quantity Value Units Method Reference Comment
Δvap20.3 ± 0.1kcal/molCGCPuri, Chickos, et al., 2001

Enthalpy of vaporization

ΔvapH (kcal/mol) Temperature (K) Method Reference Comment
18.8368.GCFalconer and Bidleman, 1994Based on data from 343. - 398. K.

References

Puri, Chickos, et al., 2001
Puri, Swati; Chickos, James S.; Welsh, William J., Determination of Vaporization Enthalpies of Polychlorinated Biphenyls by Correlation Gas Chromatography, Anal. Chem., 2001, 73, 7, 1480-1484, https://doi.org/10.1021/ac001246p . [all data]

Falconer and Bidleman, 1994
Falconer, Renee L.; Bidleman, Terry F., Vapor pressures and predicted particle/gas distributions of polychlorinated biphenyl congeners as functions of temperature and ortho-chlorine substitution, Atmospheric Environment, 1994, 28, 3, 547-554, https://doi.org/10.1016/1352-2310(94)90130-9 . [all data]