1,1'-Biphenyl, 2,2',3,5'-tetrachloro-

Kovats' RI, non-polar column, isothermal

View large format table.

Column type Active phase Temperature (C) I Reference Comment
CapillaryOV-101150.1916.Zell, Neu, et al., 1977Column length: 27. m
CapillaryOV-101150.1916.Zell, Neu, et al., 1977Column length: 27. m
CapillaryOV-101180.1937.8Krupcik, Leclercq, et al., 1976Column length: 50. m
CapillaryOV-101190.1948.1Krupcik, Leclercq, et al., 1976Column length: 50. m
CapillaryOV-101200.1958.8Krupcik, Leclercq, et al., 1976Column length: 50. m
CapillaryOV-101200.1958.1Krupcik, Leclercq, et al., 1976Column length: 50. m

Van Den Dool and Kratz RI, non-polar column, temperature ramp

View large format table.

Column type Active phase I Reference Comment
CapillaryCP Sil 5 CB1919.Wells, Gillespie, et al., 1985120. C @ 1. min, 3. K/min; Column length: 25. m; Column diameter: 0.22 mm; Tend: 250. C

Normal alkane RI, non-polar column, isothermal

View large format table.

Column type Active phase Temperature (C) I Reference Comment
CapillaryApiezon L180.1978.Ballschmiter and Zell, 1980H2; Column length: 40. m; Column diameter: 0.30 mm
CapillaryApiezon L180.1978.Ballschmiter and Zell, 1980H2; Column length: 40. m; Column diameter: 0.30 mm
CapillaryApiezon L180.1978.Ballschmiter and Zell, 1980H2; Column length: 40. m; Column diameter: 0.30 mm

Normal alkane RI, non-polar column, temperature ramp

View large format table.

Column type Active phase I Reference Comment
CapillarySPB-11922.Nakano, Tsuji, et al., 198730. m/0.25 mm/0.25 μm, 4. K/min; Tstart: 130. C; Tend: 280. C

Normal alkane RI, non-polar column, custom temperature program

View large format table.

Column type Active phase I Reference Comment
CapillaryApolane1944.Bush, Murphy, et al., 1985He; Column length: 50. m; Column diameter: 0.25 mm; Program: 70 0C (2 min) 10 0C/min (6 min) 2 0C/min -> 250 0C
CapillaryApolane1944.Bush, Murphy, et al., 1985He; Column length: 50. m; Column diameter: 0.25 mm; Program: 70 0C (2 min) 10 0C/min (6 min) 2 0C/min -> 250 0C
CapillaryOV-1, SE-30, Methyl silicone, SP-2100, OV-101, DB-1, etc.1919.Waggott and Davies, 1984Hydrogen; Column length: 50. m; Column diameter: 0.32 mm; Program: not specified

References

Zell, Neu, et al., 1977
Zell, M.; Neu, H.J.; Ballschmiter, K., Identifizierung der PCB-Komponenten durch retentionsindexvergleich nach kapillar-gaschromatographie, Chemosphere, 1977, 2/3, 2-3, 69-76, https://doi.org/10.1016/0045-6535(77)90047-9 . [all data]

Krupcik, Leclercq, et al., 1976
Krupcik, J.; Leclercq, P.A.; Símová, A.; Suchánek, P.; Collák, M.; Hrivnák, J., Possibilities and limitations of capillary gas chromatography and mass spectrometry in the analysis of polychlorinated biphenyls, J. Chromatogr., 1976, 119, 271-283, https://doi.org/10.1016/S0021-9673(00)86791-6 . [all data]

Wells, Gillespie, et al., 1985
Wells, D.E.; Gillespie, M.J.; Porter, A.E.A., Dichlorobenzyl alkyl ether homologs as retention index markers and internal standards for the analysis of environmental samples using capillary gas chromatography, J. Hi. Res. Chromatogr. Chromatogr. Comm., 1985, 8, 8, 443-449, https://doi.org/10.1002/jhrc.1240080818 . [all data]

Ballschmiter and Zell, 1980
Ballschmiter, K.; Zell, M., Analysis of polychlorinated biphenyls (PCB) by glass capillary gas chromatography, Fresenius Z. Anal. Chem., 1980, 302, 1, 20-31, https://doi.org/10.1007/BF00469758 . [all data]

Nakano, Tsuji, et al., 1987
Nakano, T.; Tsuji, M.; Okuno, T., Analytical methods for PCB using GC/ECD and GC/MS with capillary column, Report of the Environmental Science Institute of Hyoho Prefecture, 1987, 19, 57-62. [all data]

Bush, Murphy, et al., 1985
Bush, B.; Murphy, M.J.; Connor, S.; Snow, J.; Barnard, E., Improvements in Glass Capillary Gas Chromatographic Polychlorobiphenyl Analysis, J. Chromatogr. Sci., 1985, 23, 11, 509-515, https://doi.org/10.1093/chromsci/23.11.509 . [all data]

Waggott and Davies, 1984
Waggott, A.; Davies, I.W., Identification of organic pollutants using linear temperature programmed retention indices (LTPRIs) - Part II, 1984, retrieved from http://dwi.defra.gov.uk/research/completed-research/reports/dwi0383.pdf. [all data]