Butanedioyl dihydrazide

Condensed phase thermochemistry data

Data compiled by: Hussein Y. Afeefy, Joel F. Liebman, and Stephen E. Stein

Quantity Value Units Method Reference Comment
Δcsolid-630.15 ± 0.11kcal/molCcbKibler and Hunt, 1949Reanalyzed by Cox and Pilcher, 1970, Original value = -630.88 ± 0.11 kcal/mol
Δcsolid-630.58 ± 0.11kcal/molCcbSullivan, Kibler, et al., 1948

References

Kibler and Hunt, 1949
Kibler, G.M.; Hunt, H., Heats of combustion. V. The heats of combustion of five nitrogen-containing compounds, J. Phys. Chem., 1949, 53, 955-956. [all data]

Cox and Pilcher, 1970
Cox, J.D.; Pilcher, G., Thermochemistry of Organic and Organometallic Compounds, Academic Press, New York, 1970, 1-636. [all data]

Sullivan, Kibler, et al., 1948
Sullivan, M.V.; Kibler, G.M.; Hunt, H., Heats of combustion of nitrogen containing compounds, Rpt. Tech. Memo. PUR-3 for USN Project SQUID Contract N6ori-104, Task Order No. 1 Designation No. NR 22 042 by Purdue University, Lafayette, IN, 1948, 1-46. [all data]