trans-Furfurylideneacetone

Van Den Dool and Kratz RI, polar column, temperature ramp

Data compiled by: NIST Mass Spectrometry Data Center, William E. Wallace, director

Column type Capillary
Active phase CP-WAX 57CB
Column length (m) 50.
Carrier gas He
Substrate
Column diameter (mm) 0.24
Phase thickness (μm)
Tstart (C) 50.
Tend (C) 210.
Heat rate (K/min) 2.
Initial hold (min) 5.
Final hold (min)
I 1890.
ReferenceBaltes and Mevissen, 1988
Comment MSDC-RI

References

Baltes and Mevissen, 1988
Baltes, W.; Mevissen, L., Model reactions on roast aroma formation. VI. Volatile reaction products from the reaction of phenylalanine with glucose during cooking and roasting, Z. Lebensm. Unters. Forsch., 1988, 187, 3, 209-214, https://doi.org/10.1007/BF01043341 . [all data]