CHF=CF2+

Vibrational and/or electronic energy levels

Data compiled by: Marilyn E. Jacox

State:   H,I

 Energy
 (cm-1
 Med.   Transition   λmin
 (nm)
 λmax
 (nm)

References

Tx = 80680 ± 320 gas Sell and Kuppermann, 1979
Bieri, Niessen, et al., 1981

State:   G

 Energy
 (cm-1
 Med.   Transition   λmin
 (nm)
 λmax
 (nm)

Tx = 68300 ± 1000 gas Sell and Kuppermann, 1979
Bieri, Niessen, et al., 1981

State:   F

 Energy
 (cm-1
 Med.   Transition   λmin
 (nm)
 λmax
 (nm)

Tx = 63900 ± 320 gas Sell and Kuppermann, 1979
Bieri, Niessen, et al., 1981

State:   D,E

 Energy
 (cm-1
 Med.   Transition   λmin
 (nm)
 λmax
 (nm)

Tx = 52900 ± 1000 gas Sell and Kuppermann, 1979
Bieri, Niessen, et al., 1981

State:   C

 Energy
 (cm-1
 Med.   Transition   λmin
 (nm)
 λmax
 (nm)

Tx = 50500 ± 1000 gas Sell and Kuppermann, 1979
Bieri, Niessen, et al., 1981

State:   B

 Energy
 (cm-1
 Med.   Transition   λmin
 (nm)
 λmax
 (nm)

Tx = 46500 ± 1000 gas Sell and Kuppermann, 1979
Bieri, Niessen, et al., 1981

State:   A

 Energy
 (cm-1
 Med.   Transition   λmin
 (nm)
 λmax
 (nm)

Tx = 36150 ± 320 gas Sell and Kuppermann, 1979
Bieri, Niessen, et al., 1981

State:   X

Vib.
sym.
 No.   Approximate
 type of mode
 cm-1   Med.   Method   References

a' 600 ± 80 gas PE Sell and Kuppermann, 1979

Additional references: Jacox, 1994, page 340

Sell and Kuppermann, 1979
Sell, J.A.; Kuppermann, A., Variable angle photoelectron spectroscopy of the fluoroethylenes, J. Chem. Phys., 1979, 71, 4703. [all data]

Bieri, Niessen, et al., 1981
Bieri, G.; Niessen, W.V.; Asbrink, L.; Svensson, A., The He(II) photoelectron spectra of the fluorosubstituted ethylenes and their analysis by the green's function method, Chem. Phys., 1981, 60, 61. [all data]

Jacox, 1994
Jacox, M.E., Vibrational and electronic energy levels of polyatomic transient molecules, American Chemical Society, Washington, DC, 1994, 464. [all data]