Phosphenodithioic ethane

Gas phase ion energetics data

Data compiled by: Sharon G. Lias and Joel F. Liebman

Ionization energy determinations

IE (eV) Method Reference
9.45PEBock, Kremer, et al., 1992

References

Bock, Kremer, et al., 1992
Bock, H.; Kremer, M.; Solouki, B.; Binnewies, M., Darstellung und Photoelektronen-Spektrum von Ethyldithioxo-5-phosphoran H5C2-P(=S)2, Chem. Ber., 1992, 125, 315. [all data]