Benzene, 1,2-dimethyl-4-(1-methylethyl)-

Kovats' RI, non-polar column, isothermal

Data compiled by: NIST Mass Spectrometry Data Center, William E. Wallace, director

Column type CapillaryCapillaryCapillaryCapillary
Active phase OV-101OV-101OV-101Squalane
Column length (m) 50.278.278.50.
Carrier gas HeH2H2N2
Substrate
Column diameter (mm) 0.200.250.250.25
Phase thickness (μm)
Temperature (C) 100.100.100.70.
I 1130.1130.1130.1117.5
ReferenceMatisová, Kovacicová, et al., 1989Matisová, Rukríglová, et al., 1988Matisová, Rukríglová, et al., 1988Udarov, Manukov, et al., 1987
Comment MSDC-RI MSDC-RI MSDC-RI MSDC-RI

Normal alkane RI, non-polar column, isothermal

Data compiled by: NIST Mass Spectrometry Data Center, William E. Wallace, director

Column type CapillaryCapillary
Active phase OV-1OV-1
Column length (m) 40.40.
Carrier gas HeHe
Substrate
Column diameter (mm) 0.500.50
Phase thickness (μm)
Temperature (C) 120.120.
I 1140.1140.
ReferenceProtic, Svob, et al., 1980Protic, Svob, et al., 1980
Comment MSDC-RI MSDC-RI

References

Matisová, Kovacicová, et al., 1989
Matisová, E.; Kovacicová, E.; Ha, P.T.; Kolek, E.; Engewald, W., Identification of alkylbenzenes up to C12 by capillary gas chromatography-mass spectrometry. II. Retention indices on OV-101 columns and retention-molecular structure correlations, J. Chromatogr., 1989, 475, 2, 113-123, https://doi.org/10.1016/S0021-9673(01)89667-9 . [all data]

Matisová, Rukríglová, et al., 1988
Matisová, E.; Rukríglová, M.; Krupcík, J.; Kovacicová, E.; Holotík, S., Identification of alkylbenzenes up to C12 by capillary gas chromatography and combined gas chromatography-mass spectrometry. I. OV-101 as stationary phase, J. Chromatogr., 1988, 455, 301-309, https://doi.org/10.1016/S0021-9673(01)82129-4 . [all data]

Udarov, Manukov, et al., 1987
Udarov, B.G.; Manukov, E.N.; Vyglazov, O.G.; Chuiko, V.A.; Izotova, L.V., Gas-chromatographic analysis of alkylated derivatives of carane and of cyclohelptane in capillary columns, Chem. Nat. Compd. (Engl. Transl.), 1987, 22, 4, 398-403, https://doi.org/10.1007/BF00579809 . [all data]