2,6,10-Dodecatrien-1-ol, 3,7,11-trimethyl-, acetate, (E,E)-

Normal alkane RI, non-polar column, custom temperature program

Data compiled by: NIST Mass Spectrometry Data Center, William E. Wallace, director

Column type CapillaryCapillaryCapillaryCapillaryCapillary
Active phase DB-1CP Sil 8 CBHP-5MSCP Sil 8 CBSE-30
Column length (m) 30.30.30.50.
Carrier gas Helium HeHe
Substrate
Column diameter (mm) 0.250.250.250.32
Phase thickness (μm) 0.250.25 0.25
Program not specified60C => 2.5C/min => 170C => 10C/min => 250C (5min)40C(10min) => 3C/min => 200C => 2C/min => 220C60 0C (2 min) 5 0C/min -> 160 0C 10 0C/min -> 250 0C (5 min)not specified
I 1826.1843.1843.1847.1821.
ReferenceXu, Tang, et al., 2010Kristiawan, Sobolik, et al., 2008Takaku, Haber, et al., 2007Mockute, Bernotiene, et al., 2006Vinogradov, 2004
Comment MSDC-RI MSDC-RI MSDC-RI MSDC-RI MSDC-RI
Column type Capillary
Active phase Methyl Silicone
Column length (m)
Carrier gas
Substrate
Column diameter (mm)
Phase thickness (μm)
Program not specified
I 1821.
ReferenceZenkevich, 1999
Comment MSDC-RI

Normal alkane RI, polar column, temperature ramp

Data compiled by: NIST Mass Spectrometry Data Center, William E. Wallace, director

Column type CapillaryCapillaryCapillaryCapillaryCapillary
Active phase DB-WaxSupelcowax-10DB-WaxSupelcowax-10DB-Wax
Column length (m) 60.30.60.30.60.
Carrier gas HeHeN2HeHe
Substrate
Column diameter (mm) 0.250.250.250.250.25
Phase thickness (μm) 0.250.250.25 0.25
Tstart (C) 60.50.70.60.50.
Tend (C) 180.220.230.240.180.
Heat rate (K/min) 3.4.2.4.2.5
Initial hold (min) 8.3.2. 5.
Final hold (min) 80.30.20.
I 2255.2257.2259.2261.2234.
ReferenceWei A. and Shibamoto T., 2007Wong and Tan, 2005Choi, 2004Lamarque, Maestri, et al., 1998Stashenko, Torres, et al., 1995
Comment MSDC-RI MSDC-RI MSDC-RI MSDC-RI MSDC-RI

Phase change data

Data compiled by: Robert L. Brown and Stephen E. Stein

Reduced pressure boiling point

Tboil (K) Pressure (bar) Reference
393.20.0004Aldrich Chemical Company Inc., 1990

Kovats' RI, non-polar column, temperature ramp

View large format table.

Column type Active phase I Reference Comment
CapillaryHP-51812.Yáñez, Pinzón, et al., 200250. m/0.25 mm/0.25 μm, He, 50. C @ 5. min, 2.5 K/min; Tend: 250. C
CapillaryDB-51843.Adams, 200030. m/0.26 mm/0.25 μm, He, 3. K/min; Tstart: 60. C; Tend: 240. C

Kovats' RI, non-polar column, custom temperature program

View large format table.

Column type Active phase I Reference Comment
CapillaryDB-51843.Adams, 199830. m/0.26 mm/0.25 μm; Program: not specified

Kovats' RI, polar column, temperature ramp

View large format table.

Column type Active phase I Reference Comment
CapillaryInnowax2234.Yáñez, Pinzón, et al., 200250. m/0.25 mm/0.25 μm, He, 50. C @ 5. min, 2.5 K/min; Tend: 180. C
CapillaryCarbowax 20M2222.Gaydou, Randriamiharisoa, et al., 198650. m/0.3 mm/0.15 μm, H2, 2. K/min; Tstart: 70. C; Tend: 210. C

Van Den Dool and Kratz RI, non-polar column, temperature ramp

View large format table.

Column type Active phase I Reference Comment
CapillaryHP-5MS1840.Benkaci-Ali, Baaliouamer, et al., 200730. m/0.25 mm/0.25 μm, He, 60. C @ 8. min, 2. K/min, 250. C @ 30. min
CapillarySPB-11828.Blagojevic, Radulovic, et al., 200630. m/0.25 mm/0.25 μm, He, 50. C @ 3. min, 5. K/min, 250. C @ 15. min
CapillaryDB-51844.Blagojevic, Radulovic, et al., 200630. m/0.2 mm/0.25 μm, He, 50. C @ 3. min, 5. K/min, 250. C @ 15. min
CapillaryDB-51846.Dob, Dahmane, et al., 200630. m/0.32 mm/0.25 μm, N2, 60. C @ 3. min, 3. K/min, 240. C @ 5. min
CapillaryBP-11816.Gonny, Cavaleiro, et al., 200650. m/0.22 mm/0.25 μm, He, 2. K/min, 220. C @ 20. min; Tstart: 60. C
CapillaryDB-11826.Boyom, Assembe, et al., 200330. m/0.25 mm/0.25 μm, N2, 5. K/min, 200. C @ 0. min; Tstart: 50. C
CapillaryHP-51843.Skaltsa, Demetzos, et al., 200330. m/0.25 mm/0.25 μm, He, 60. C @ 5. min, 4. K/min; Tend: 280. C
CapillaryHP-5MS1843.Demetzos, Angelopoulou, et al., 200230. m/0.25 mm/0.25 μm, 50. C @ 5. min, 3. K/min; Tend: 280. C
CapillaryDB-11816.bin Jantan and bin Ahmad, 2002N2, 60. C @ 10. min, 3. K/min, 180. C @ 10. min; Column length: 25. m; Column diameter: 0.25 mm
CapillaryDB-51837.Nogueira, Bittrich, et al., 200130. m/0.25 mm/0.25 μm, H2, 3. K/min; Tstart: 60. C; Tend: 240. C
CapillaryHP-51839.Song, Sawamura, et al., 200030. m/0.25 mm/0.25 μm, He, 2. K/min; Tstart: 70. C; Tend: 230. C

Van Den Dool and Kratz RI, non-polar column, custom temperature program

View large format table.

Column type Active phase I Reference Comment
CapillaryDB-51842.Andrade, Sampaio, et al., 200730. m/0.25 mm/0.25 μm, He; Program: 40C(2min) => 4C/min => 220C => 20C/min => 280C
CapillarySE-521842.Mondello, Dugo, et al., 199560. m/0.32 mm/0.40 μm, He; Program: 45 C (6 min) 3 C/min -> 111 0C 2 C/min -> 160 C 3 C/min -> 300 C (15 min)

Van Den Dool and Kratz RI, polar column, temperature ramp

View large format table.

Column type Active phase I Reference Comment
CapillaryBP-202265.Gonny, Cavaleiro, et al., 200650. m/0.22 mm/0.25 μm, He, 2. K/min, 220. C @ 20. min; Tstart: 60. C
CapillaryDB-Wax2282.Choi, 200560. m/0.25 mm/0.25 μm, N2, 70. C @ 2. min, 2. K/min, 230. C @ 20. min
CapillaryDB-Wax2283.Choi, 200360. m/0.25 mm/0.25 μm, N2, 70. C @ 2. min, 2. K/min, 230. C @ 20. min
CapillaryDB-Wax2276.Choi and Sawamura, 200060. m/0.25 mm/0.25 μm, N2, 70. C @ 2. min, 2. K/min, 230. C @ 20. min
CapillaryHP-Wax2280.Christensen, Jakobsen, et al., 199750. m/0.2 mm/0.4 μm, He, 30. C @ 1. min, 5. K/min, 220. C @ 30. min
CapillaryCarbowax 20M2251.Mondello, Dugo, et al., 199560. m/0.32 mm/0.425 μm, He, 45. C @ 3. min, 3. K/min, 300. C @ 20. min

Normal alkane RI, non-polar column, temperature ramp

View large format table.

Column type Active phase I Reference Comment
CapillaryHP-5 MS1854.Pripdeevech and Saansoomchai, 201330. m/0.25 mm/0.25 μm, Helium, 3. K/min; Tstart: 60. C; Tend: 230. C
CapillaryHP-5 MS1844.Radulovic, Blagojevic, et al., 201030. m/0.25 mm/0.25 μm, Helium, 5. K/min, 290. C @ 10. min; Tstart: 70. C
CapillaryDB-11817.Xu, Tang, et al., 201030. m/0.25 mm/0.25 μm, Helium, 50. C @ 2. min, 4. K/min, 220. C @ 2. min
CapillaryHP-51844.Saidana, Mahjoub, et al., 200830. m/0.25 mm/0.25 μm, Nitrogen, 50. C @ 1. min, 5. K/min, 280. C @ 1. min
CapillaryCol-Elite 5MS1847.Gudaityte and Venskutonis R.P., 200730. m/0.25 mm/0.25 μm, He, 3. K/min; Tstart: 30. C; Tend: 246. C
CapillaryDB-11824.Pala-Paul, Brophy, et al., 200750. m/0.25 mm/0.25 μm, He, 4. K/min; Tstart: 95. C; Tend: 240. C
CapillaryDB-51850.Morteza-Semnani, Saeedi, et al., 200630. m/0.25 mm/0.25 μm, He, 60. C @ 4. min, 4. K/min; Tend: 260. C
CapillaryHP-51816.Wang, Yang, et al., 200630. m/0.25 mm/0.25 μm, He, 60. C @ 2. min, 10. K/min, 250. C @ 10. min
CapillaryDB-51818.Tzakou and Constantinidis, 200530. m/0.32 mm/0.25 μm, He, 3. K/min; Tstart: 60. C; Tend: 280. C
CapillarySPB-11810.Wong, Lee, et al., 200550. m/0.2 mm/0.33 μm, He, 50. C @ 3. min, 4. K/min, 220. C @ 30. min
CapillaryDB-51837.Limberger, Sobral, et al., 200430. m/0.25 mm/0.25 μm, He, 3. K/min; Tstart: 60. C; Tend: 300. C
CapillaryDB-51836.Woerdenbag, Windono, et al., 200430. m/0.249 mm/0.25 μm, He, 3. K/min; Tstart: 60. C; Tend: 300. C
CapillaryOptima-11814.Brun, Bessière, et al., 200125. m/0.20 mm/0.25 μm, He, 50. C @ 3. min, 3. K/min; Tend: 250. C
CapillaryDB-11814.Palá-Paúl, Pérez-Alonso, et al., 200130. m/0.25 mm/0.25 μm, N2, 4. K/min; Tstart: 80. C; Tend: 225. C
CapillaryDB-11814.Palá-Paúl, Pérez-Alonso, et al., 199950. m/0.25 mm/0.25 μm, He, 4. K/min; Tstart: 70. C; Tend: 240. C
CapillaryOV-1011814.Camciuc, Bessière, et al., 199850. m/0.22 mm/1. μm, He, 100. C @ 1. min, 1. K/min; Tend: 220. C
CapillaryCBP-11844.Lamarque, Maestri, et al., 1998He, 4. K/min; Column length: 30. m; Column diameter: 0.25 mm; Tstart: 60. C; Tend: 240. C
CapillaryDB-51843.Sohounhloue, Dangou, et al., 199640. C @ 2. min, 2. K/min, 210. C @ 33. min; Column length: 30. m; Column diameter: 0.25 mm
CapillaryDB-11814.Stashenko, Torres, et al., 199560. m/0.25 mm/0.25 μm, He, 50. C @ 5. min, 3.5 K/min; Tend: 250. C
CapillaryDB-11815.Shiota, 199160. m/0.25 mm/0.25 μm, He, 3. K/min; Tstart: 50. C; Tend: 240. C
CapillaryDB-11824.Shiota, 199160. m/0.25 mm/0.25 μm, He, 3. K/min; Tstart: 50. C; Tend: 240. C

Normal alkane RI, polar column, custom temperature program

View large format table.

Column type Active phase I Reference Comment
CapillaryCarbowax 20M2242.Vinogradov, 2004Program: not specified
CapillaryHP-Innowax FSC2273.Bagci, Baser, et al., 199960. m/0.25 mm/0.25 μm, He; Program: 60C(10min) => 4C/min => 220C(10min) => 1C/min => 240C
CapillaryHP-Innowax FSC2273.Kamariah, Lim, et al., 199960. m/0.25 mm/0.25 μm, He; Program: 60C(10min) => 4C/min => 220C(10min) => 1C/min => 240C(20min)

References

Xu, Tang, et al., 2010
Xu, X.; Tang, Z.; Liang, Y., Comparative analysis of plant essential oils by GC-MS coupled with integrated chemometric resolution methods, Anal. Methods, 2010, 2, 4, 359-367, https://doi.org/10.1039/b9ay00213h . [all data]

Kristiawan, Sobolik, et al., 2008
Kristiawan, M.; Sobolik, V.; Al-Haddad, M.; Allaf, K., Effect of pressure-drop rate on the isolation of cananga oil using instantaneous controlled pressure-drop process, Chem. Eng. Processing, 2008, 47, 1, 66-75, https://doi.org/10.1016/j.cep.2007.08.011 . [all data]

Takaku, Haber, et al., 2007
Takaku, S.; Haber, W.A.; Setzer, W.N., Leaf essential oil composition of 10 species of Ocotea (Lauraceae) from Monteverde, Costa Rica, Biochem. Syst. Ecol., 2007, 35, 8, 525-532, https://doi.org/10.1016/j.bse.2007.02.003 . [all data]

Mockute, Bernotiene, et al., 2006
Mockute, D.; Bernotiene, G.; Judzentiene, A., Germacrene D chemotype of essential oils of Leonurus cardiaca L. growing wild in Vilnus district (Lithuania), J. Essent. Oil Res., 2006, 18, 5, 566-568, https://doi.org/10.1080/10412905.2006.9699169 . [all data]

Vinogradov, 2004
Vinogradov, B.A., Production, composition, properties and application of essential oils, 2004, retrieved from http://viness.narod.ru. [all data]

Zenkevich, 1999
Zenkevich, I.G., Analytical Parameters of Components of essential Oils for their Gas Chromatographic and Chromato-Mass-Spectral Identification. Acetates of Terpene Alcohols, Rastitelnye Resursy (Plant Resources), 1999, 35, 1, 30-37. [all data]