Cholesta-2,4-diene

Normal alkane RI, non-polar column, temperature ramp

View large format table.

Column type Active phase I Reference Comment
CapillaryHP-5MS2872.Tkachev, Dobrotvorsky, et al., 200030. m/0.25 mm/0.25 μm, He, 40. C @ 1. min, 10. K/min, 280. C @ 20. min

References

Tkachev, Dobrotvorsky, et al., 2000
Tkachev, A.V.; Dobrotvorsky, A.K.; Vjalkov, A.I.; Morozov, S.V., Chemical composition of lipophylic compounds from the body surface of unfed adult Ixodes persulcatus ticks (Acari: Ixodidae), Experimental and Applied Acarology, 2000, 24, 2, 145-158, https://doi.org/10.1023/A:1006430323587 . [all data]