Dichlorosilane

Gas phase thermochemistry data

Quantity Value Units Method Reference Comment
Δfgas-320.49kJ/molReviewChase, 1998Data last reviewed in December, 1976
Quantity Value Units Method Reference Comment
gas,1 bar286.72J/mol*KReviewChase, 1998Data last reviewed in December, 1976

Gas Phase Heat Capacity (Shomate Equation)

Cp° = A + B*t + C*t2 + D*t3 + E/t2
H° − H°298.15= A*t + B*t2/2 + C*t3/3 + D*t4/4 − E/t + F − H
S° = A*ln(t) + B*t + C*t2/2 + D*t3/3 − E/(2*t2) + G
    Cp = heat capacity (J/mol*K)
    H° = standard enthalpy (kJ/mol)
    S° = standard entropy (J/mol*K)
    t = temperature (K) / 1000.

View plot Requires a JavaScript / HTML 5 canvas capable browser.

View table.

Temperature (K) 298. - 1500.1500. - 6000.
A 50.10424104.7803
B 84.349441.617791
C -50.00424-0.294719
D 11.041200.018777
E -0.797169-12.70120
F -341.4382-380.2854
G 319.8513375.6132
H -320.4944-320.4944
ReferenceChase, 1998Chase, 1998
Comment Data last reviewed in December, 1976 Data last reviewed in December, 1976

Phase change data

Data compiled as indicated in comments:
BS - Robert L. Brown and Stephen E. Stein
AC - William E. Acree, Jr., James S. Chickos

Reduced pressure boiling point

Tboil (K) Pressure (bar) Reference Comment
281.31.01PCR Inc., 1990BS

Enthalpy of vaporization

ΔvapH (kJ/mol) Temperature (K) Reference Comment
22.2 ± 0.7290. - 350.Vorotyntsev, Balabanov, et al., 1986AC

Gas phase ion energetics data

Data compiled by: Sharon G. Lias, Rhoda D. Levin, and Sherif A. Kafafi

Ionization energy determinations

IE (eV) Method Reference Comment
11.70PEChadwick, Cornford, et al., 1972Vertical value
11.70PEFrost, Herring, et al., 1971Vertical value
11.64 ± 0.02PECradock and Whiteford, 1971Vertical value

Vibrational and/or electronic energy levels

Data compiled by: Takehiko Shimanouchi

Symmetry:   C     Symmetry Number σ = 2

 Sym.   No   Approximate   Selected Freq.  Infrared   Raman   Comments
 Species   type of mode   Value   Rating   Value  Phase  Value  Phase

a1 1 SiH2 s-str 2224  C 2224 S gas 2221 S p liq.
a1 2 SiH2 scis 954  C 954 S gas 942 W dp liq.
a1 3 SiCl2 s-str 527  C 527 W gas 514 S p liq.
a1 4 SiCl2 scis 188  D 188 M dp liq.
a2 5 SiH2 twist 710  D  ia 710 W dp liq.
b1 6 SiH2 a-str 2237  B 2237 S gas
b1 7 SiH2 rock 602  C 602 W gas
b2 8 SiH2 wag 876  B 876 VS gas 868 VW dp liq.
b2 9 SiCl2 a-str 590  C 590 S gas 566 VW dp liq.

Source: Shimanouchi, 1972

References

Chase, 1998
Chase, M.W., Jr., NIST-JANAF Themochemical Tables, Fourth Edition, J. Phys. Chem. Ref. Data, Monograph 9, 1998, 1-1951. [all data]

PCR Inc., 1990
PCR Inc., Research Chemicals Catalog 1990-1991, PCR Inc., Gainesville, FL, 1990, 1. [all data]

Vorotyntsev, Balabanov, et al., 1986
Vorotyntsev, V.M.; Balabanov, V.V.; Shamrakov, D.A., Zh. Fiz. Khim., 1986, 60, 234. [all data]

Chadwick, Cornford, et al., 1972
Chadwick, D.; Cornford, A.B.; Frost, D.C.; Herring, F.G.; Katrib, A.; McDowell, C.A.; McLean, R.A.N., Photoelectron spectra of some dihalocompounds in Electron spectroscopy, ed. D.A. Shirley (North-Holland Publixhing Co, Amsterdam), 1972, 453. [all data]

Frost, Herring, et al., 1971
Frost, D.C.; Herring, F.G.; Katrib, A.; McLean, R.A.N.; Drake, J.E.; Westwood, N.P.C., Photoelectron spectra and bonding in some halosilanes, Can. J. Chem., 1971, 49, 4033. [all data]

Cradock and Whiteford, 1971
Cradock, S.; Whiteford, R.A., Photo-electron spectra of the mono and dihalo silanes and germanes, J. Chem. Soc. Faraday Trans., 1971, 67, 3425. [all data]

Shimanouchi, 1972
Shimanouchi, T., Tables of Molecular Vibrational Frequencies Consolidated Volume II, J. Phys. Chem. Ref. Data, 1972, 6, 3, 993-1102. [all data]