2-Propanamine, 2-methyl-N-methylene-, N-oxide

Gas phase ion energetics data

Data compiled by: Sharon G. Lias, Rhoda D. Levin, and Sherif A. Kafafi

Ionization energy determinations

IE (eV) Method Reference Comment
8.64PEHouk, Bimanand, et al., 1977
8.64PEHouk, Caramella, et al., 1977Vertical value

References

Houk, Bimanand, et al., 1977
Houk, K.N.; Bimanand, A.; Mukherjee, D.; Sims, J.; Chang, Y.-M.; Kaufman, D.C.; Domelsmith, L.N., Nitrone ionization potentials and cycloaddition regioselectivities, J. Heterocycl. Chem., 1977, 7, 293. [all data]

Houk, Caramella, et al., 1977
Houk, K.N.; Caramella, P.; Munchausen, L.L.; Chang, Y.-M.; Battaglia, A.; Sims, J.; Kaufman, D.C., Photoelectron spectra of nitrones and nitrile oxides, J. Electron Spectrosc. Relat. Phenom., 1977, 10, 441. [all data]