Tris(2-aminoethyl)amine

Condensed phase thermochemistry data

Data compiled by: Hussein Y. Afeefy, Joel F. Liebman, and Stephen E. Stein

Quantity Value Units Method Reference Comment
Δfliquid-17.6 ± 0.2kcal/molCcbGutner, Lebedeva, et al., 1979
Quantity Value Units Method Reference Comment
Δcliquid-1161.5 ± 0.2kcal/molCcbGutner, Lebedeva, et al., 1979

References

Gutner, Lebedeva, et al., 1979
Gutner, N.M.; Lebedeva, N.D.; Kiseleva, N.N., Enthalpies of combustion and formation of some acyl-substituted diamines, Termodin. Org. Soedin., 1979, 97-98. [all data]