[bis[(trifluoromethyl)sulphonyl]methyl]benzene

Gas phase ion energetics data

Data compiled by: John E. Bartmess

De-protonation reactions

C9H5F6O4S2- + Hydrogen cation = [bis[(trifluoromethyl)sulphonyl]methyl]benzene

By formula: C9H5F6O4S2- + H+ = C9H6F6O4S2

Quantity Value Units Method Reference Comment
Δr300.0 ± 2.0kcal/molIMRELeito, Raamat, et al., 2009gas phase
Δr301.3 ± 2.0kcal/molIMREKoppel, Taft, et al., 1994gas phase; Per Leito, Raamat, et al., 2009, dGacid is likely too weak by up to 1.3 kcal/mol.

References

Leito, Raamat, et al., 2009
Leito, I.; Raamat, E.; Kutt, A.; Saame, J.; Kipper, K.; Koppel, I.A.; Koppel, I.; Zhang, M.; Mishima, M.; Yagupolskii, L.M.; Garlyauskayte, R.Y.; Filatov, A.A., Revision of the Gas-Phase Acidity Scale below 300 kcal mol(-1), J. Phys. Chem. A, 2009, 113, 29, 8421-8424, https://doi.org/10.1021/jp903780k . [all data]

Koppel, Taft, et al., 1994
Koppel, I.A.; Taft, R.W.; Anvia, F.; Zhu, S.Z.; Hu, L.Q.; Sung, K.S.; Desmarteau, D.D.; Yagupolskii, L.M., The Gas-Phase Acidities of Very Strong Neutral Bronsted Acids, J. Am. Chem. Soc., 1994, 116, 7, 3047, https://doi.org/10.1021/ja00086a038 . [all data]