Verbenene

Normal alkane RI, polar column, temperature ramp

Data compiled by: NIST Mass Spectrometry Data Center, William E. Wallace, director

Column type CapillaryCapillaryCapillaryCapillary
Active phase Supelcowax-10Supelcowax-10Supelcowax-10DB-Wax
Column length (m) 30.30.30.60.
Carrier gas HeHe He
Substrate
Column diameter (mm) 0.20.250.250.25
Phase thickness (μm) 0.20.250.250.25
Tstart (C) 70.40.40.60.
Tend (C) 220.250.220.240.
Heat rate (K/min) 3.3.3.4.
Initial hold (min)  5.5.
Final hold (min) 15.10.10.
I 1131.1119.1119.1126.
ReferencePinto, Salgueiro, et al., 2007Vichi, Riu-Aumatell, et al., 2007Vichi, Riu-Aumatell, et al., 2005Ngassoum, Yonkeu, et al., 1999
Comment MSDC-RI MSDC-RI MSDC-RI MSDC-RI

Kovats' RI, non-polar column, temperature ramp

Data compiled by: NIST Mass Spectrometry Data Center, William E. Wallace, director

Column type CapillaryCapillaryCapillaryCapillaryCapillary
Active phase DB-5MSDB-5DB-5MSDB-5MSHP-5MS
Column length (m) 30.30.30.30.30.
Carrier gas HeHeHeHeHe
Substrate
Column diameter (mm) 0.250.260.250.250.25
Phase thickness (μm) 0.250.250.250.250.25
Tstart (C) 60.60.60.60.60.
Tend (C) 180.246.240.180.280.
Heat rate (K/min) 3.3.3.3.3.
Initial hold (min)    15.
Final hold (min) 15.
I 951.967.969.967.935.
ReferenceAngioni, Barra, et al., 2006Adams and Nguyen, 2005Maia, Andrade, et al., 2005Angioni, Barra, et al., 2004Gkinis, Tzakou, et al., 2003
Comment MSDC-RI MSDC-RI MSDC-RI MSDC-RI MSDC-RI
Column type CapillaryCapillaryCapillaryCapillaryCapillary
Active phase DB-5DB-5DB-5DB-5DB-5
Column length (m) 25.30.30.30.30.
Carrier gas He HeHeHe
Substrate
Column diameter (mm) 0.220.250.260.260.26
Phase thickness (μm) 0.250.50.250.250.25
Tstart (C) 60.50.60.60.60.
Tend (C) 240.250.240.246.246.
Heat rate (K/min) 3.7.3.3.3.
Initial hold (min)  3.
Final hold (min)  10.
I 951.972.2967.967.975.
ReferenceEl-Ghorab, Fadel, et al., 2002El-Massry, El-Ghorab, et al., 2002Adams, 2000Adams, 2000, 2Adams, 1999
Comment MSDC-RI MSDC-RI MSDC-RI MSDC-RI MSDC-RI

References

Pinto, Salgueiro, et al., 2007
Pinto, E.; Salgueiro, L.R.; Cavaleiro, C.; Palmeira, A.; Goncalves, M.J., In vitro susceptibility of some species of yeasts and filamentous fungi to essential oils of Salvia of?cinalis, Ind. Crops Prod., 2007, 26, 2, 135-141, https://doi.org/10.1016/j.indcrop.2007.02.004 . [all data]

Vichi, Riu-Aumatell, et al., 2007
Vichi, S.; Riu-Aumatell, M.; Mora-Pons, M.; Guadayol, J.M.; Buxaderas, S.; López-Tamames, E., Analytical, Nutritional and Clinical Methods. HS-SPME coupled to GC/MS for quality control of Juniperus communis L. berries used for gin aromatization, Food Chem., 2007, 105, 4, 1748-1754, https://doi.org/10.1016/j.foodchem.2007.03.026 . [all data]

Vichi, Riu-Aumatell, et al., 2005
Vichi, S.; Riu-Aumatell, M.; Mora-Pons, M.; Buxaderas, S.; Lopez-Tamames, E., Characterization of Volatiles in Different Dry Gins, J. Agric. Food Chem., 2005, 53, 26, 10154-10160, https://doi.org/10.1021/jf058121b . [all data]

Ngassoum, Yonkeu, et al., 1999
Ngassoum, M.B.; Yonkeu, S.; Jirovetz, L.; Buchbauer, G.; Schmaus, G.; Hammerschmidt, F.-J.H., Chemical composition of essential oils of Lantana camara leaves and flowers from Cameroon and Madagascar, Flavour Fragr. J., 1999, 14, 4, 245-250, https://doi.org/10.1002/(SICI)1099-1026(199907/08)14:4<245::AID-FFJ819>3.0.CO;2-X . [all data]