2-Propyn-1-amine, N,N-diethyl-

Kovats' RI, non-polar column, isothermal

Data compiled by: NIST Mass Spectrometry Data Center, William E. Wallace, director

Column type Packed
Active phase Apiezon L
Column length (m) 2.7
Carrier gas
Substrate Chromosorb G AW (80-100 mesh)
Column diameter (mm)
Phase thickness (μm)
Temperature (C) 80.
I 757.
ReferenceZhuravleva, Golovnya, et al., 1981
Comment MSDC-RI

References

Zhuravleva, Golovnya, et al., 1981
Zhuravleva, I.L.; Golovnya, R.V.; Terenina, M.B.; Grigorieva, D.N., Gas chromatographic behaviour of some unsymmetrical tertiary amines, Zh. Anal. Khim., 1981, 36, 968-975. [all data]