Thiazolidine, 2-hexyl-

Kovats' RI, non-polar column, custom temperature program

View large format table.

Column type Active phase I Reference Comment
CapillaryDB-11402.Umano and Shibamoto, 1987N2; Column length: 30. m; Column diameter: 0.25 mm; Program: 40C(10min) => 200C(2C/min)

References

Umano and Shibamoto, 1987
Umano, K.; Shibamoto, T., Analysis of headspace volatiles from overheated beef fat, J. Agric. Food Chem., 1987, 35, 1, 14-18, https://doi.org/10.1021/jf00073a004 . [all data]