1-Phenylheneicosane

Condensed phase thermochemistry data

Data compiled by: Hussein Y. Afeefy, Joel F. Liebman, and Stephen E. Stein

Quantity Value Units Method Reference Comment
Δfliquid-508.1 ± 6.7kJ/molCcbParks, West, et al., 1946Reanalyzed by Cox and Pilcher, 1970, Original value = -505.6 ± 0.2 kJ/mol
Δfliquid-506.8 ± 6.7kJ/molCcbKnowlton and Huffman, 1944Reanalyzed by Cox and Pilcher, 1970, Original value = -508.4 kJ/mol
Quantity Value Units Method Reference Comment
Δcliquid-16980.8 ± 6.7kJ/molCcbParks, West, et al., 1946Reanalyzed by Cox and Pilcher, 1970, Original value = -16979.5 ± 6.8 kJ/mol; Corresponding Δfliquid = -503.92 kJ/mol (simple calculation by NIST; no Washburn corrections)
Δcliquid-16977.8 ± 6.7kJ/molCcbKnowlton and Huffman, 1944Reanalyzed by Cox and Pilcher, 1970, Original value = -16977. kJ/mol; Corresponding Δfliquid = -506.85 kJ/mol (simple calculation by NIST; no Washburn corrections)

Phase change data

Data compiled by: William E. Acree, Jr., James S. Chickos

Enthalpy of vaporization

ΔvapH (kJ/mol) Temperature (K) Reference Comment
108.4461.Dykyj, Svoboda, et al., 1999Based on data from 446. - 705. K.

References

Parks, West, et al., 1946
Parks, G.S.; West, T.J.; Naylor, B.F.; Fujii, P.S.; McClaine, L.A., Thermal data on organic compounds. XXIII. Modern combustion data for fourteen hydrocarbons and five polyhydroxy alcohols, J. Am. Chem. Soc., 1946, 68, 2524-2527. [all data]

Cox and Pilcher, 1970
Cox, J.D.; Pilcher, G., Thermochemistry of Organic and Organometallic Compounds, Academic Press, New York, 1970, 1-636. [all data]

Knowlton and Huffman, 1944
Knowlton, J.W.; Huffman, H.M., The heats of combustion of some substituted eicosanes, heneicosanes and docosanes, J. Am. Chem. Soc., 1944, 66, 1492-1494. [all data]

Dykyj, Svoboda, et al., 1999
Dykyj, J.; Svoboda, J.; Wilhoit, R.C.; Frenkel, M.L.; Hall, K.R., Vapor Pressure of Chemicals: Part A. Vapor Pressure and Antoine Constants for Hydrocarbons and Sulfur, Selenium, Tellurium and Hydrogen Containing Organic Compounds, Springer, Berlin, 1999, 373. [all data]