3(2H)-Furanone, 4-methoxy-2,5-dimethyl-

Van Den Dool and Kratz RI, non-polar column, temperature ramp

View large format table.

Column type Active phase I Reference Comment
CapillaryHP-51065.Quijano, Salamanca, et al., 200730. m/0.25 mm/0.25 μm, He, 50. C @ 4. min, 4. K/min, 250. C @ 10. min
CapillaryHP-5MS1065.Pino, Mesa, et al., 200530. m/0.25 mm/0.25 μm, He, 60. C @ 2. min, 4. K/min, 250. C @ 20. min
CapillarySPB-51064.Rodríguez-Burruezo, Kollmannsberger, et al., 200430. m/0.53 mm/1.5 μm, He, 5. K/min; Tstart: 100. C; Tend: 250. C
CapillaryCP Sil 5 CB1027.Pino, Marbot, et al., 200250. m/0.32 mm/0.4 μm, He, 60. C @ 10. min, 3. K/min, 280. C @ 60. min
CapillaryHP-51057.0Siegmund, Derler, et al., 200130. m/0.25 mm/0.25 μm, He, 5.3 K/min, 280. C @ 5. min; Tstart: 35. C

Van Den Dool and Kratz RI, non-polar column, custom temperature program

View large format table.

Column type Active phase I Reference Comment
CapillaryDB-5MS1056.Boulanger and Crouzet, 200030. m/0.25 mm/0.25 μm, He; Program: 60 0C (3 min) 2 K/min -> 220 0C 5 K/min -> 250 0C (15 min)
CapillaryDB-51057.Boulanger, Chassagne, et al., 199930. m/0.25 mm/0.25 μm, H2; Program: 40C(5min) => 2C/min => 220C => 5C/min => 250C(15min)

Van Den Dool and Kratz RI, polar column, temperature ramp

View large format table.

Column type Active phase I Reference Comment
CapillaryDB-Wax1584.Osorio, Alarcon, et al., 200630. m/0.25 mm/0.25 μm, He, 50. C @ 4. min, 4. K/min, 220. C @ 20. min
CapillaryDB-Wax1602.Bell, 200430. m/0.32 mm/0.50 μm, Helium, 7. K/min, 240. C @ 5. min; Tstart: 40. C
CapillaryDB-Wax Etr1580.Ménager, Jost, et al., 200430. m/0.25 mm/0.25 μm, He, 40. C @ 3. min, 3. K/min, 245. C @ 20. min
CapillaryDB-Wax1600.0Siegmund, Derler, et al., 200130. m/0.32 mm/0.5 μm, He, 1.1 K/min, 250. C @ 10. min; Tstart: 35. C
CapillaryDB-Wax1556.Ollé, Baumes, et al., 199830. m/0.32 mm/0.5 μm, 40. C @ 3. min, 3. K/min, 245. C @ 20. min
CapillaryDB-Wax1584.Umano, Hagi, et al., 1992He, 40. C @ 10. min, 2. K/min; Column length: 30. m; Column diameter: 0.25 mm; Tend: 200. C

Van Den Dool and Kratz RI, polar column, custom temperature program

View large format table.

Column type Active phase I Reference Comment
CapillarySOLGel-Wax1561.Aubert, Baumann, et al., 200530. m/0.25 mm/0.25 μm, He; Program: 35C(5min) => 3C/min => 150C => 5C/min => 250C(10 min)
CapillaryDB-Wax1580.Boulanger and Crouzet, 200030. m/0.25 mm/0.25 μm, H2; Program: 60 0C (3 min) 2 K/min -> 220 0C 5 K/min -> 250 0C (15 min)

Normal alkane RI, non-polar column, temperature ramp

View large format table.

Column type Active phase I Reference Comment
CapillaryHP-51051.Azodanlou, Darbellay, et al., 200325. m/0.2 mm/0.33 μm, He, 4. K/min, 190. C @ 5. min; Tstart: 40. C
CapillaryOV-1011031.Tamura, Boonbumrung, et al., 2000Nitrogen, 40. C @ 10. min, 2. K/min; Column length: 50. m; Column diameter: 0.25 mm; Tend: 200. C
CapillaryDB-11031.Takeoka and Butter, 1989He, 30. C @ 4. min, 2. K/min; Column length: 60. m; Column diameter: 0.32 mm; Tend: 210. C
CapillaryDB-11032.Takeoka and Butter, 1989He, 30. C @ 4. min, 2. K/min; Column length: 60. m; Column diameter: 0.32 mm; Tend: 210. C

Normal alkane RI, non-polar column, custom temperature program

View large format table.

Column type Active phase I Reference Comment
CapillaryDB-51055.Tokitomo, Steihaus, et al., 200530. m/0.32 mm/0.25 μm, Helium; Program: 40 0C (2 min) 40 0C/min -> 60 0C (2 min) 6 0C/min -> 180 0C 10 0C/min -> 240 0C (5 min)

Normal alkane RI, polar column, temperature ramp

View large format table.

Column type Active phase I Reference Comment
CapillaryDB-Wax1604.Tamura, Boonbumrung, et al., 2000Nitrogen, 40. C @ 10. min, 2. K/min; Column length: 60. m; Column diameter: 0.25 mm; Tend: 200. C
CapillaryDB-Wax1576.Werkhoff, Güntert, et al., 199860. m/0.32 mm/0.25 μm, H2, 3. K/min; Tstart: 60. C; Tend: 220. C
CapillaryHP-Innowax1625.Ulrich, Hoberg, et al., 199760. m/0.32 mm/0.5 μm, H2, 1.5 K/min; Tstart: 50. C; Tend: 180. C

Normal alkane RI, polar column, custom temperature program

View large format table.

Column type Active phase I Reference Comment
CapillaryDB-Wax1554.Parker, Tsormpatsidis, et al., 2010Program: not specified
CapillaryCP-Wax 58CB1578.Tokitomo, Steihaus, et al., 200525. m/0.32 mm/0.20 μm, Helium; Program: 40 0C (2 min) 40 0C/min -> 60 0C (1 min) 6 0C/min -> 180 0C 10 0C/min -> 240 0C (5 min)

References

Quijano, Salamanca, et al., 2007
Quijano, C.E.; Salamanca, G.; Pino, J.A., Aroma volatile constituents of Colombian varieties of mango (Mangifera indica L.), Flavour Fragr. J., 2007, 22, 5, 401-406, https://doi.org/10.1002/ffj.1812 . [all data]

Pino, Mesa, et al., 2005
Pino, J.A.; Mesa, J.; Muñoz, Y.; Martí, M.P.; Marbot, R., Volatile components from mango (Mangifera indica L.) cultivars, J. Agric. Food Chem., 2005, 53, 6, 2213-2223, https://doi.org/10.1021/jf0402633 . [all data]

Rodríguez-Burruezo, Kollmannsberger, et al., 2004
Rodríguez-Burruezo, A.; Kollmannsberger, H.; Prohens, J.; Nitz, S.; Nuez, F., Analysis of the volatile aroma constituents of parental and hybrid clones of pepino (Solanum muricatum), J. Agric. Food Chem., 2004, 52, 18, 5663-5669, https://doi.org/10.1021/jf040107w . [all data]

Pino, Marbot, et al., 2002
Pino, J.A.; Marbot, R.; Vázquez, C., Characterization of volatile in Cosa Rican Guava [Psidium friedrichsthalianum (Berg) Niedenzu] fruit, J. Agric. Food Chem., 2002, 50, 21, 6023-6026, https://doi.org/10.1021/jf011456i . [all data]

Siegmund, Derler, et al., 2001
Siegmund, B.; Derler, K.; Pfannhauser, W., Changes in the aroma of a strawberry drink during storage, J. Agric. Food Chem., 2001, 49, 7, 3244-3252, https://doi.org/10.1021/jf010116u . [all data]

Boulanger and Crouzet, 2000
Boulanger, R.; Crouzet, J., Free and bound flavour components of Amazonian fruits: 2. cupuacu volatile compounds, Flavour Fragr. J., 2000, 15, 4, 251-257, https://doi.org/10.1002/1099-1026(200007/08)15:4<251::AID-FFJ905>3.0.CO;2-2 . [all data]

Boulanger, Chassagne, et al., 1999
Boulanger, R.; Chassagne, D.; Crouzet, J., Free and bound flavour components of amazonian fruits. 1: Bacuri, Flavour Fragr. J., 1999, 14, 5, 303-311, https://doi.org/10.1002/(SICI)1099-1026(199909/10)14:5<303::AID-FFJ834>3.0.CO;2-C . [all data]

Osorio, Alarcon, et al., 2006
Osorio, C.; Alarcon, M.; Moreno, C.; Bonilla, A.; Barrios, J.; Garzon, C.; Duque, C., Characterization of Odor-Active Volatiles in Champa ( Campomanesia lineatifolia R. P.), J. Agric. Food Chem., 2006, 54, 2, 509-516, https://doi.org/10.1021/jf052098c . [all data]

Bell, 2004
Bell, W.A.-M., Examination of Aroma Volatiles Formed from Thermal Processing of Florida Reconstituted Grapefruit Juice. A Thesis presented to the graduate school of the university of Florida in partial fulfillment of the requirements for the degree of master of science, 2004. [all data]

Ménager, Jost, et al., 2004
Ménager, I.; Jost, M.; Aubert, C., Changes in physicochemical characteristics and volatile constituents of strawberry (Cv. Cigaline) during maturation, J. Agric. Food Chem., 2004, 52, 5, 1248-1254, https://doi.org/10.1021/jf0350919 . [all data]

Ollé, Baumes, et al., 1998
Ollé, D.; Baumes, R.L.; Bayonove, C.L.; Lozano, Y.F.; Sznaper, C.; Brillouet, J.-M., Comparison of free and glycosidically linked volatile components from polyembryonic and monoembryonic mango (Mangifera indica L.) cultivars, J. Agric. Food Chem., 1998, 46, 3, 1094-1100, https://doi.org/10.1021/jf9705781 . [all data]

Umano, Hagi, et al., 1992
Umano, K.; Hagi, Y.; Nakahara, K.; Shoji, A.; Shibamoto, T., Volatile constituents of green and ripened pineapple (Aanas comosus [L.] Merr.), J. Agric. Food Chem., 1992, 40, 4, 599-603, https://doi.org/10.1021/jf00016a014 . [all data]

Aubert, Baumann, et al., 2005
Aubert, C.; Baumann, S.; Arguel, H., Optimization of the Analysis of Flavor Volatile Compounds by Liquid-Liquid Microextraction (LLME). Application to the Aroma Analysis of Melons, Peaches, Grapes, Strawberries, and Tomatoes, J. Agric. Food Chem., 2005, 53, 23, 8881-8895, https://doi.org/10.1021/jf0510541 . [all data]

Azodanlou, Darbellay, et al., 2003
Azodanlou, R.; Darbellay, C.; Luisier, J.-L.; Villettaz, J.-C.; Amadò, R., Quality assessment of strawberries (Fragaria species), J. Agric. Food Chem., 2003, 51, 3, 715-721, https://doi.org/10.1021/jf0200467 . [all data]

Tamura, Boonbumrung, et al., 2000
Tamura, H.; Boonbumrung, S.; Yoshizawa, T.; Varanyanond, W., Volatile components of the essential oil in the pulp of four yellow mangoes (Mangifera indica L.) in Thailand, Food Sci. Technol. Res., 2000, 6, 1, 68-73, https://doi.org/10.3136/fstr.6.68 . [all data]

Takeoka and Butter, 1989
Takeoka, G.; Butter, R.G., Volatile constituents of pineapple (Ananas Comosus [L.] Merr.) in Flavor Chemistry. Trends and Developments, Teranishi,R.; Buttery,R.G.; Shahidi,F., ed(s)., American Chemical Society, Washington, DC, 1989, 223-237. [all data]

Tokitomo, Steihaus, et al., 2005
Tokitomo, Y.; Steihaus, M.; Buttner, A.; Schieberle, P., Odor-Active Constituents in Fresh Pineapple (ananas comosus [L.] Merr.) by Quamtitative and Sensory Evaluations, Biosci. Biotechnol, Biochem,, 2005, 69, 7, 1323-1330, https://doi.org/10.1271/bbb.69.1323 . [all data]

Werkhoff, Güntert, et al., 1998
Werkhoff, P.; Güntert, M.; Krammer, G.; Sommer, H.; Kaulen, J., Vacuum headspace method in aroma research: flavor chemistry of yellow passion fruits, J. Agric. Food Chem., 1998, 46, 3, 1076-1093, https://doi.org/10.1021/jf970655s . [all data]

Ulrich, Hoberg, et al., 1997
Ulrich, D.; Hoberg, E.; Rapp, A.; Kecke, S., Analysis of strawberry flavour - discrimination of aroma types by quantification of volatile compounds, Z. Lebensm. Unters. Forsch. A, 1997, 205, 3, 218-223, https://doi.org/10.1007/s002170050154 . [all data]

Parker, Tsormpatsidis, et al., 2010
Parker, J.K.; Tsormpatsidis, E.; Elmore, J.S.; Wagstaffe, A.; Mottram, D.S., Solid-phase extraction as a routine method for comparing key aroma compounds in fruits in Expression of Multidisciplinary Flavour Science, Blank, I.; Wust, M.; Yeretzian C., ed(s)., Zurcher Hochschule fur Angewandte Wissenschaften, Wadenswil, Switzerland, 2010, 521-524. [all data]