Benzeneethanamine, N,N,α-trimethyl-

Kovats' RI, polar column, isothermal

Data compiled by: NIST Mass Spectrometry Data Center, William E. Wallace, director

Column type PackedPacked
Active phase PEG-20MPEG-20M
Column length (m)
Carrier gas N2
Substrate  Chromosorb W
Column diameter (mm)
Phase thickness (μm)
Temperature (C) 120.120.
I 1568.1568.
ReferenceHuber, Kenndler, et al., 1979Donike and Stratmann, 1976
Comment MSDC-RI MSDC-RI

Normal alkane RI, non-polar column, temperature ramp

Data compiled by: NIST Mass Spectrometry Data Center, William E. Wallace, director

Column type Packed
Active phase SE-30
Column length (m) 2.
Carrier gas Nitrogen
Substrate Chromosorb G AW DMCS (80-100 mesh)
Column diameter (mm)
Phase thickness (μm)
Tstart (C) 100.
Tend (C) 300.
Heat rate (K/min)
Initial hold (min)
Final hold (min)
I 1236.
ReferenceMHA, 9999
Comment MSDC-RI

References

Huber, Kenndler, et al., 1979
Huber, J.F.K.; Kenndler, E.; Reich, G., Quantitation of the Information Content of Multi-Dimensional Gas Chromatography and Low- Resolution Mass Spectrometry in the Identification of Doping Drugs, J. Chromatogr., 1979, 172, 1, 15-30, https://doi.org/10.1016/S0021-9673(00)90941-5 . [all data]

Donike and Stratmann, 1976
Donike, M.; Stratmann, D., Gas-chromatographische identifizierung von stimulantien der phenyläthylaminreihe mit hilfe der retnetions-indices, Z. Anal. Chem., 1976, 279, 2, 129-131, https://doi.org/10.1007/BF00440798 . [all data]