Acetic acid, trifluoro-, 2,2,2-trifluoroethyl ester
- Formula: C4H2F6O2
- Molecular weight: 196.0479
- IUPAC Standard InChIKey: ZKUJOCJJXCPCFS-UHFFFAOYSA-N
- CAS Registry Number: 407-38-5
- Chemical structure:

Phase change data

Data compiled as indicated in comments:
BS - Robert L. Brown and Stephen E. Stein
AC - William E. Acree, Jr., James S. Chickos
Quantity | Value | Units | Method | Reference | Comment |
---|---|---|---|---|---|
Tboil | 328. | K | N/A | PCR Inc., 1990 | BS |
Tboil | 328.2 | K | N/A | Weast and Grasselli, 1989 | BS |
Enthalpy of vaporization
ΔvapH (kJ/mol) | Temperature (K) | Method | Reference | Comment |
---|---|---|---|---|
31.8 | 330. | HG | Majid and Shreeve, 1973 | AC |

References

PCR Inc., 1990
PCR Inc.,
Research Chemicals Catalog 1990-1991, PCR Inc., Gainesville, FL, 1990, 1. [all data]
Weast and Grasselli, 1989
CRC Handbook of Data on Organic Compounds, 2nd Editon, Weast,R.C and Grasselli, J.G., ed(s)., CRC Press, Inc., Boca Raton, FL, 1989, 1. [all data]
Majid and Shreeve, 1973
Majid, A.; Shreeve, Jean'ne M.,
Fluorinated esters stable to fluoride ion,
J. Org. Chem., 1973, 38, 23, 4028-4031, https://doi.org/10.1021/jo00987a016
. [all data]