Ethyl (trimethylsilyl)acetate

Phase change data

Data compiled by: Robert L. Brown and Stephen E. Stein

Quantity Value Units Method Reference Comment
Tboil429. - 431.KN/AFarchan Laboratories, 1990

Van Den Dool and Kratz RI, non-polar column, temperature ramp

View large format table.

Column type Active phase I Reference Comment
CapillaryVF-5MS942.N/A30. m/0.25 mm/0.25 μm, He; Tstart: 60. C; Tend: 270. C

Normal alkane RI, non-polar column, custom temperature program

View large format table.

Column type Active phase I Reference Comment
CapillaryPolydimethyl siloxanes930.Zenkevich, 2001Program: not specified

References

Farchan Laboratories, 1990
Farchan Laboratories, Research Chemicals Catalog, Farchan Laboratories, Gainesville, FL, 1990, 91. [all data]

Zenkevich, 2001
Zenkevich, I.G., Encyclopedia of Chromatography. Derivatization of Hydroxy Compounds for GC Analysis, Marcel Dekker, Inc., New York - Basel, 2001, 237. [all data]