1,6,10-Dodecatrien-3-ol, 3,7,11-trimethyl-, (E)-

Van Den Dool and Kratz RI, polar column, custom temperature program

Data compiled by: NIST Mass Spectrometry Data Center, William E. Wallace, director

Column type CapillaryCapillaryCapillaryCapillaryCapillary
Active phase CP-Wax 52CBDB-WaxDB-WaxBP-20Carbowax 20M
Column length (m) 60.30.60.25.25.
Carrier gas HeHeHeHeH2
Substrate
Column diameter (mm) 0.250.250.250.250.32
Phase thickness (μm) 0.250.250.250.250.25
Program 45C(5min) => 10C/min => 80C => 2C/min => 240C40 (5min) => 4C/min => 140C => 4C/min => 200C (20min)35C(0.7min) => 20C/min => 70C => 4C/min => 240C40C(8min) => 3C/min => 180C => 20C/min => 230C40 0C (8 min) 3 K/min -> 180 0C 20 K/min -> 230 0C
I 2035.2020.2025.2066.2037.
ReferenceRomeo, Ziino, et al., 2007Zheng, Kim, et al., 2005Ferrari, Lablanquie, et al., 2004Lorenzo, Loayza, et al., 2003Lorenzo, Saavedra, et al., 2001
Comment MSDC-RI MSDC-RI MSDC-RI MSDC-RI MSDC-RI
Column type Capillary
Active phase Carbowax 20M
Column length (m) 25.
Carrier gas H2
Substrate
Column diameter (mm) 0.32
Phase thickness (μm) 0.25
Program 40 0C (8 min) 3 K/min -> 180 0C 20 K/min -> 230 0C
I 2052.
ReferenceLoayza, de Groot, et al., 1999
Comment MSDC-RI

References

Romeo, Ziino, et al., 2007
Romeo, V.; Ziino, M.; Giuffrrida, D.; Condurso, C.; Verzera, A., Flavour profile of capers (Capparis spinosa L.) from the Eolian Archipelago by HS-SPME/GC?MS, Food Chem., 2007, 101, 3, 1272-1278, https://doi.org/10.1016/j.foodchem.2005.12.029 . [all data]

Zheng, Kim, et al., 2005
Zheng, C.H.; Kim, K.H.; Kim, T.H.; Lee, H.J., Analysis and characterization of aroma-active compounds of Schizandra chinensis (omija) leaves, J. Sci. Food Agric., 2005, 85, 1, 161-166, https://doi.org/10.1002/jsfa.1975 . [all data]

Ferrari, Lablanquie, et al., 2004
Ferrari, G.; Lablanquie, O.; Cantagrel, R.; Ledauphin, J.; Payot, T.; Fournier, N.; Guichard, E., Determination of key odorant compounds in freshly distilled cognac using GC-O, GC-MS, and sensory evaluation, J. Agric. Food Chem., 2004, 52, 18, 5670-5676, https://doi.org/10.1021/jf049512d . [all data]

Lorenzo, Loayza, et al., 2003
Lorenzo, D.; Loayza, I.; Dellacassa, E., Composition of the essential oils from leaves of two Hedyosmum spp. from Bolivia, Flavour Fragr. J., 2003, 18, 1, 32-35, https://doi.org/10.1002/ffj.1146 . [all data]

Lorenzo, Saavedra, et al., 2001
Lorenzo, D.; Saavedra, G.; Loayza, I.; Dellacassa, E., Composition of the essential oil of Erechtites hieracifolia from Bolivia, Flavour Fragr. J., 2001, 16, 5, 353-355, https://doi.org/10.1002/ffj.1010 . [all data]

Loayza, de Groot, et al., 1999
Loayza, I.; de Groot, W.; Lorenzo, D.; Dellacassa, E.; Mondello, L.; Dugo, G., Composition of the essential oil of Porophyllum ruderale (Jacq.) Cass. from Bolivia, Flavour Fragr. J., 1999, 14, 6, 393-398, https://doi.org/10.1002/(SICI)1099-1026(199911/12)14:6<393::AID-FFJ849>3.0.CO;2-5 . [all data]