SeF5

Gas phase ion energetics data

Data compiled by: John E. Bartmess

Electron affinity determinations

EA (eV) Method Reference Comment
>5.099621R-ACompton, Reinhardt, et al., 1978
3.30 ± 0.10EIAEHarland and Thynne, 1973From SeF6; G2MP2 calculations indicate an EA of ca. 2.0 eV

References

Compton, Reinhardt, et al., 1978
Compton, R.N.; Reinhardt, P.W.; Cooper, C.D., Collisional ionization between fast alkali atoms and selected hexafluoride molecules, J. Chem. Phys., 1978, 68, 2023. [all data]

Harland and Thynne, 1973
Harland, P.W.; Thynne, J.C.J., Comparision of negative ion formation by the hexafluorides of sulphur, selenium, tellurium, and tungsten, Inorg. Nucl. Chem. Lett., 1973, 9, 265. [all data]