(Z)5-Dodecen-1-ol

Phase change data

Data compiled by: William E. Acree, Jr., James S. Chickos

Quantity Value Units Method Reference Comment
Δvap90.2kJ/molCGCOva, Koultek, et al., 2000Based on data from 333. - 373. K. See also Koutek, Hoskovec, et al., 1994.

Kovats' RI, non-polar column, isothermal

View large format table.

Column type Active phase Temperature (C) I Reference Comment
PackedApiezon L170.1419.Nedopekina, Kovalev, et al., 1981N2, Chromatron N-AW-HMDS; Column length: 2.5 m

Van Den Dool and Kratz RI, non-polar column, temperature ramp

View large format table.

Column type Active phase I Reference Comment
CapillaryDB-51461.Marques, McElfresh, et al., 200030. m/0.25 mm/0.25 μm, 100. C @ 1. min, 5. K/min, 275. C @ 3. min

Van Den Dool and Kratz RI, polar column, temperature ramp

View large format table.

Column type Active phase I Reference Comment
CapillaryDB-Wax2007.Marques, McElfresh, et al., 200030. m/0.32 mm/0.25 μm, 100. C @ 1. min, 5. K/min; Tend: 240. C

Normal alkane RI, polar column, isothermal

View large format table.

Column type Active phase Temperature (C) I Reference Comment
CapillaryPEG160.2019.Guo, Yuan, et al., 1984Column length: 30. m; Column diameter: 0.36 mm
CapillaryFFAP210.1995.Guo, Yuan, et al., 1984Column length: 80. m; Column diameter: 0.30 mm

References

Ova, Koultek, et al., 2000
Ova, P.V.; Koultek, B.; Hoskovec, M., Practice Oriented Results on Use and Production of Neem Ingredients and Pheromones VI, H. Kleeberg and C.P.W. Zebitz, ed(s)., Druck and Graphic, Giessen, 2000, 211-218. [all data]

Koutek, Hoskovec, et al., 1994
Koutek, Bohumír; Hoskovec, Michal; Vrkocová, Pavlína; Konecný, Karel; Feltl, Ladislav, Gas chromatographic determination of vapour pressures of pheromone-like compounds II. Alcohols, Journal of Chromatography A, 1994, 679, 2, 307-317, https://doi.org/10.1016/0021-9673(94)80573-3 . [all data]