Rhenium, pentacarbonylsilyl-

Gas phase ion energetics data

Data compiled by: Sharon G. Lias, Rhoda D. Levin, and Sherif A. Kafafi

Ionization energy determinations

IE (eV) Method Reference Comment
8.9 ± 0.1PECradock, Ebsworth, et al., 1973Vertical value

References

Cradock, Ebsworth, et al., 1973
Cradock, S.; Ebsworth, E.A.V.; Robertson, A., Photoelectron spectra of some silyl and germyl transition-metal carbonyls and related specis, J. Chem. Soc. Dalton Trans., 1973, 22. [all data]