(d) 3-(m-bromophenyl)-3-hydroxypropanoic acid

Phase change data

Data compiled by: William E. Acree, Jr., James S. Chickos

Enthalpy of fusion

ΔfusH (kcal/mol) Temperature (K) Reference
5.700350.Chickos, Braton, et al., 1991

References

Chickos, Braton, et al., 1991
Chickos, James S.; Braton, C. Marie; Hesse, Donald G.; Liebman, Joel F., Estimating entropies and enthalpies of fusion of organic compounds, J. Org. Chem., 1991, 56, 3, 927-938, https://doi.org/10.1021/jo00003a007 . [all data]