Butyronitrile, 2,3,3-trimethyl-2-(4-nitrophenyldiazenyl)-

Gas phase ion energetics data

Data compiled by: Sharon G. Lias, Rhoda D. Levin, and Sherif A. Kafafi

Appearance energy determinations

Ion AE (eV) Other Products MethodReferenceComment
C6H4NO2+13.4C7H12N3EINuyken and Messmer, 1977
C6H4N3O2+11.6C7H12NEINuyken and Messmer, 1977

References

Nuyken and Messmer, 1977
Nuyken, O.; Messmer, K., Massenspektrometrische untersuchungen an azoverbindungen. II- Ermittlung thermodynamischer grossen, Org. Mass Spectrom., 1977, 12, 106. [all data]