Benzene,2-fluoroethoxy-

Gas phase ion energetics data

Data compiled by: Sharon G. Lias, Rhoda D. Levin, and Sherif A. Kafafi

Ionization energy determinations

IE (eV) Method Reference
8.63EIRussell, Gross, et al., 1979

Appearance energy determinations

Ion AE (eV) Other Products MethodReferenceComment
C6H6O+11.18C2H3FEIRussell, Gross, et al., 1979

References

Russell, Gross, et al., 1979
Russell, D.H.; Gross, M.L.; Van der Greef, J.; Nibbering, N.M.M., The chemistry of C6H6O radical cations: A study of rearrangement reactions of halogen substituted ethyl phenyl ethers, Org. Mass Spectrom., 1979, 14, 474. [all data]