endo-Fenchyl acetate

Normal alkane RI, non-polar column, temperature ramp

Data compiled by: NIST Mass Spectrometry Data Center, William E. Wallace, director

Column type CapillaryCapillaryCapillaryCapillaryCapillary
Active phase HP-5HP-5DB-5HP-5SE-52
Column length (m) 30.30.30.30.50.
Carrier gas HydrogenHeliumHeHeHelium
Substrate
Column diameter (mm) 0.250.250.250.250.25
Phase thickness (μm) 0.250.320.320.32
Tstart (C) 70.60.50.60.50.
Tend (C) 290.250.250.250.240.
Heat rate (K/min) 5.5.5.5.3.
Initial hold (min)  30. 30.
Final hold (min)
I 1225.1218.1207.1218.1220.
ReferenceRadulovic, Dordevic, et al., 2010Yassa and Akhani, 2008Nori-Shargh, Raftari, et al., 2007Yassa and Akhani, 2007Ozcan, Chalchat, et al., 2006
Comment MSDC-RI MSDC-RI MSDC-RI MSDC-RI MSDC-RI
Column type CapillaryCapillaryCapillaryCapillaryCapillary
Active phase DB-1HP-5MSRSL-200DB-5HP-5
Column length (m) 50.25.30.30.30.
Carrier gas N2HeH2HeHe
Substrate
Column diameter (mm) 0.250.250.320.250.25
Phase thickness (μm) 0.25 0.250.250.25
Tstart (C) 95.50.40.60.60.
Tend (C) 240.250.280.240.275.
Heat rate (K/min) 4.3.6.3.4.
Initial hold (min)  3.5.
Final hold (min)  10.5.
I 1215.1222.1210.1220.1217.
ReferencePala-Paul J., Perez-Alonso M.J., et al., 2006Ghasemi Y., Faridi P., et al., 2005Jirovetz, Buchbauer, et al., 2003da Silva, Luz, et al., 2003Ghannadi, Sajjadi, et al., 2002
Comment MSDC-RI MSDC-RI MSDC-RI MSDC-RI MSDC-RI
Column type CapillaryCapillary
Active phase HP-5DB-5MS
Column length (m) 30.30.
Carrier gas H2He
Substrate
Column diameter (mm) 0.250.25
Phase thickness (μm) 0.250.25
Tstart (C) 40.60.
Tend (C) 280.240.
Heat rate (K/min) 4.3.
Initial hold (min)
Final hold (min)
I 1220.1223.
ReferenceVelickovic, Randjelovic, et al., 2002Zoghbi, Andrade, et al., 1999
Comment MSDC-RI MSDC-RI

References

Radulovic, Dordevic, et al., 2010
Radulovic, N.S.; Dordevic, N.D.; Palic, R.M., Volatiles of Pleurospermum austriacum (L.) Hoffm. (Apiaceae), J. Serbian Chem. Soc., 2010, 75, 12, 1-11, https://doi.org/10.2298/JSC100323127R . [all data]

Yassa and Akhani, 2008
Yassa, N.; Akhani, H., The essential oils composition in two species of the genus Eriocycla Lindl. (Apiaceae) from Iran, 2008, retrieved from http://biology.ut.ac.ir/members/akhani/PdfReprintNumber/27.pdf. [all data]

Nori-Shargh, Raftari, et al., 2007
Nori-Shargh, D.; Raftari, S.; Deyhimi, F., Analysis of the essential oil of Grammosciadium scabridum Boiss. from Iran, Flavour Fragr. J., 2007, 22, 5, 350-351, https://doi.org/10.1002/ffj.1803 . [all data]

Yassa and Akhani, 2007
Yassa, N.; Akhani, H., The essential oils composition in two species of the genus Eriocycla Lindl. (Apiaceae) from Iran, 2007, retrieved from http://biology.ut.ac.ir/members/akhani/PdfReprintNumber/27.pdf. [all data]

Ozcan, Chalchat, et al., 2006
Ozcan, M.M.; Chalchat, J.-C.; Arslan, D.; Ates, A.; Unver, A., Comparative Essential Oil Composition and Antifungal Effect of Bitter Fennel (Foeniculum vulgare ssp. piperitum) Fruit Oils Obtained During Different Vegetation, J. Medicinal Food, 2006, 9, 4, 552-561, https://doi.org/10.1089/jmf.2006.9.552 . [all data]

Pala-Paul J., Perez-Alonso M.J., et al., 2006
Pala-Paul J.; Perez-Alonso M.J.; Velasco-Negueruela A.; Ballesteros M.T.; Sanz J., Essential oil composition of Sideritis hirsuta L. from Guadalajara Province, Spain, Flavour Fragr. J., 2006, 21, 3, 410-415, https://doi.org/10.1002/ffj.1727 . [all data]

Ghasemi Y., Faridi P., et al., 2005
Ghasemi Y.; Faridi P.; Mehregan I.; Mohagheghzadeh A., Ferula gummosa fruits: An aromatic antimicrobial agent, Chem. Nat. Compd. (Engl. Transl.), 2005, 41, 3, 311-314, https://doi.org/10.1007/s10600-005-0138-3 . [all data]

Jirovetz, Buchbauer, et al., 2003
Jirovetz, L.; Buchbauer, G.; Shafi, M.P.; Leela, N.K., Analysis of the essential oils of the leaves, stems, rhizomes and roots of the medicinal plant Alpinia galanga from southern India, Acta Pharm. Hung., 2003, 53, 73-81. [all data]

da Silva, Luz, et al., 2003
da Silva, J.D.; Luz, A.I.R.; da Silva, M.H.L.; Andrade, E.H.A.; Soghbi, M.G.B.; Maia, J.G.S., Essential oils of the leaves and stems of four Psidium spp., Flavour Fragr. J., 2003, 18, 3, 240-243, https://doi.org/10.1002/ffj.1219 . [all data]

Ghannadi, Sajjadi, et al., 2002
Ghannadi, A.; Sajjadi, S.E.; Beigihasan, A., Composition of the essential oil of Ferula ovina (Boiss.) Boiss. from Iran, DARU, 2002, 10, 4, 165-167, retrieved from http://www1.tums.ac.ir/daru/Daru4%202002/Ghannadi.PDF. [all data]

Velickovic, Randjelovic, et al., 2002
Velickovic, D.T.; Randjelovic, N.V.; Ristic, M.S.; Smelcerovic, A.A.; Velickovic, A.S., Chemical composition and antimicrobial action of the ethanol extracts of Salvia pratensis L., Salvia glutinosa L. and Salvia aethiopis L., J. Serb. Chem. Soc., 2002, 67, 10, 639-646, https://doi.org/10.2298/JSC0210639V . [all data]

Zoghbi, Andrade, et al., 1999
Zoghbi, M.G.B.; Andrade, E.H.A.; Maia, J.G.S., Volatile constituents from leaves and flowers of Alpinia speciosa K. Schum. and A. purpurata (Viell.) Schum., Flavour Fragr. J., 1999, 14, 6, 411-414, https://doi.org/10.1002/(SICI)1099-1026(199911/12)14:6<411::AID-FFJ854>3.0.CO;2-U . [all data]