Plumbane,trimethyl(phenylthio)-

Gas phase ion energetics data

Data compiled by: Sharon G. Lias, Rhoda D. Levin, and Sherif A. Kafafi

Ionization energy determinations

IE (eV) Method Reference
7.8 ± 0.1EIDistefano, Ricci, et al., 1974
8.15 ± 0.05PEDistefano, Pignataro, et al., 1974

Appearance energy determinations

Ion AE (eV) Other Products MethodReferenceComment
C3H9Pb+8.4 ± 0.1?EIDistefano, Ricci, et al., 1974
C8H11SPb+8.1 ± 0.1CH3EIDistefano, Ricci, et al., 1974

References

Distefano, Ricci, et al., 1974
Distefano, G.; Ricci, A.; Danieli, R.; Foffani, A.; Innorta, G.; Torroni, S., Mass spectrometric evidence for p π-d π bonding between sulfur and the Group IVB elements, J. Organomet. Chem., 1974, 65, 205. [all data]

Distefano, Pignataro, et al., 1974
Distefano, G.; Pignataro, S.; Ricci, A.; Colonna, F.P.; Pietropaolo, D., Interactions of π-orbitals with the group IV elements studied by ionization energy measurements, Ann. Chim., 1974, 64, 153. [all data]