Benzeneacetic acid, 4-fluoro-

Phase change data

Data compiled as indicated in comments:
BS - Robert L. Brown and Stephen E. Stein
TRC - Thermodynamics Research Center, NIST Boulder Laboratories, Chris Muzny director

Quantity Value Units Method Reference Comment
Tfus367.KN/ABergmann, Berkovic, et al., 1956Uncertainty assigned by TRC = 3. K; TRC

Reduced pressure boiling point

Tboil (K) Pressure (atm) Reference Comment
437.20.003Weast and Grasselli, 1989BS

In addition to the Thermodynamics Research Center (TRC) data available from this site, much more physical and chemical property data is available from the following TRC products:

References

Bergmann, Berkovic, et al., 1956
Bergmann, E.D.; Berkovic, S.; Ikan, R., A New Method for the Preparation of Aromatic Fluorine Compounds, J. Am. Chem. Soc., 1956, 78, 6037-9. [all data]

Weast and Grasselli, 1989
CRC Handbook of Data on Organic Compounds, 2nd Editon, Weast,R.C and Grasselli, J.G., ed(s)., CRC Press, Inc., Boca Raton, FL, 1989, 1. [all data]