N,N'-Bis(2-fluoro-2,2-dinitroethyl)ethanediamide

Condensed phase thermochemistry data

Data compiled by: Hussein Y. Afeefy, Joel F. Liebman, and Stephen E. Stein

Quantity Value Units Method Reference Comment
Δfsolid-977.9 ± 6.9kJ/molCcrBaroody and Carpenter, 1973Corrected for CODATA value of ΔfH; HF.120H2O
Quantity Value Units Method Reference Comment
Δcsolid-2599.5 ± 3.4kJ/molCcrBaroody and Carpenter, 1973Corrected for CODATA value of ΔfH; HF.120H2O

References

Baroody and Carpenter, 1973
Baroody, E.E.; Carpenter, G.A., Enthalpies of formation of some fluorodinitroethyl derivatives and 2,2',4,4',6,6'-hexanitroazobenzene, J. Chem. Eng. Data, 1973, 18, 28-36. [all data]