Ferulic acid ethyl ester

Normal alkane RI, non-polar column, temperature ramp

View large format table.

Column type Active phase I Reference Comment
CapillaryElite-5MS1914.Tava, Pecetti, et al., 200730. m/0.32 mm/0.5 μm, He, 40. C @ 5. min, 4. K/min, 280. C @ 10. min
CapillaryDB-51916.Güntert, Rapp, et al., 198630. m/0.25 mm/0.25 μm, He, 2. K/min; Tstart: 40. C; Tend: 250. C

References

Tava, Pecetti, et al., 2007
Tava, A.; Pecetti, L.; Ricci, M.; Pagnotta, M.A.; Russi, L., Volatile compounds from leaves and flowers of Bituminaria bituminosa (L.) Stirt. (Fabaceae) from Italy, Flavour Fragr. J., 2007, 22, 5, 363-370, https://doi.org/10.1002/ffj.1806 . [all data]

Güntert, Rapp, et al., 1986
Güntert, M.; Rapp, A.; Takeoka, G.R.; Jennings, W., HRGC and HRGC-MS applied to wine constituents of lower volatility, Z. Lebensm. Unters. Forsch., 1986, 182, 3, 200-204, https://doi.org/10.1007/BF01042128 . [all data]