Phosphine,dicyclohexyl(4-methoxyphenyl)-

Gas phase ion energetics data

Data compiled by: Sharon G. Lias, Rhoda D. Levin, and Sherif A. Kafafi

Ionization energy determinations

IE (eV) Method Reference Comment
7.88PEGoetz, Marschner, et al., 1976Vertical value

References

Goetz, Marschner, et al., 1976
Goetz, H.; Marschner, F.; Juds, H.; Pohle, H., Korrelation zwischen pKa-Werten und vertikalen Ionisations-potentialen I bei p-X-Phenyl-dicyclohexyl-phosphinen, Phosphorus Sulfur, 1976, 6, 137. [all data]