Phosphorin,1,1-dichloro-1,1-dihydro-2,4,6-triphenyl-

Gas phase ion energetics data

Data compiled by: Sharon G. Lias, Rhoda D. Levin, and Sherif A. Kafafi

Ionization energy determinations

IE (eV) Method Reference Comment
7.05PESchafer, Schweig, et al., 1976Vertical value

References

Schafer, Schweig, et al., 1976
Schafer, W.; Schweig, A.; Dimroth, K.; Kanter, H., Nature of bonding in 3l 8 45 9-phosphorins, J. Am. Chem. Soc., 1976, 98, 4410. [all data]