BrONO2

Gas phase ion energetics data

Data compiled by: Sharon G. Lias and Joel F. Liebman

Ionization energy determinations

IE (eV) Method Reference
10.60PEDianxum and Peng, 1996

Appearance energy determinations

Ion AE (eV) Other Products MethodReferenceComment
BrO+11.62NO2PIJochims, Denzer, et al., 1992
NO+13.1BrO+O/Br+O2PIJochims, Denzer, et al., 1992
NO2+10.6BrOPIJochims, Denzer, et al., 1992
NO2+13.2Br+OPIJochims, Denzer, et al., 1992

References

Dianxum and Peng, 1996
Dianxum, W.; Peng, J., He I photoelectron spectroscopy study on the electronic structure of bromine nitrate, BrONO2, J. Phys. Chem., 1996, 100, 4382. [all data]

Jochims, Denzer, et al., 1992
Jochims, H.-W.; Denzer, W.; Baumgartel, H.; Losking, O.; Willner, H., Photochemical decay reactions of N2O5, HNO3, ClNO3 and BrNO3 in the energy range 10-20 eV, Ber. Bunsen-Ges. Phys. Chem., 1992, 96, 573. [all data]