Difluoroacetanilide

Condensed phase thermochemistry data

Data compiled by: Hussein Y. Afeefy, Joel F. Liebman, and Stephen E. Stein

Quantity Value Units Method Reference Comment
Δcsolid-944.8kcal/molCcbSwarts, 1919Not corrected for CODATA value of ΔfH

References

Swarts, 1919
Swarts, F., Etudes thermochimiques sur les combinaisons organiques fluorees, J. Chim. Phys., 1919, 17, 3-70. [all data]