Heptane, 3,3-dimethyl-

Kovats' RI, non-polar column, custom temperature program

Data compiled by: NIST Mass Spectrometry Data Center, William E. Wallace, director

Column type Capillary
Active phase Petrocol DH-100
Column length (m) 100.
Carrier gas He
Substrate
Column diameter (mm) 0.2
Phase thickness (μm)
Program 5C(10min) => 5C/min => 50C(48min) => 1.5C/min => 195C(91min)
I 844.6
ReferenceHaagen-Smit Laboratory, 1997
Comment MSDC-RI

Henry's Law data

Data compiled by: Rolf Sander

Henry's Law constant (water solution)

kH(T) = H exp(d(ln(kH))/d(1/T) ((1/T) - 1/(298.15 K)))
H = Henry's law constant for solubility in water at 298.15 K (mol/(kg*bar))
d(ln(kH))/d(1/T) = Temperature dependence constant (K)

H (mol/(kg*bar)) d(ln(kH))/d(1/T) (K) Method Reference Comment
0.00019 QN/A missing citation give several references for the Henry's law constants but don't assign them to specific species.

Van Den Dool and Kratz RI, non-polar column, temperature ramp

Data compiled by: NIST Mass Spectrometry Data Center, William E. Wallace, director

Column type CapillaryCapillaryCapillaryCapillaryCapillary
Active phase OV-101PONAPetrocol DHPetrocol DHPetrocol DH
Column length (m) 80.50.100.100.100.
Carrier gas N2 HeHeHe
Substrate
Column diameter (mm) 0.220.20.250.250.25
Phase thickness (μm)  0.50.50.50.5
Tstart (C) 30.35.30.30.30.
Tend (C) 130.220.220.220.220.
Heat rate (K/min) 1.1.1.1.1.
Initial hold (min)  0.5
Final hold (min)  8.
I 839.7834.6836.13836.23835.
ReferenceYin, Liu, et al., 2001Martos, Saraullo, et al., 1997Subramaniam, Bochniak, et al., 1994Subramaniam, Bochniak, et al., 1994White, Hackett, et al., 1992
Comment MSDC-RI MSDC-RI MSDC-RI MSDC-RI MSDC-RI
Column type CapillaryCapillary
Active phase SE-30OV-101
Column length (m) 60.108.
Carrier gas H2
Substrate
Column diameter (mm) 0.250.25
Phase thickness (μm) 1.0.2
Tstart (C) 60.35.
Tend (C)  200.
Heat rate (K/min) 1.1.
Initial hold (min)
Final hold (min)
I 835.6835.
ReferenceKrupcík, Repka, et al., 1987Hayes and Pitzer, 1981
Comment MSDC-RI MSDC-RI

Normal alkane RI, non-polar column, temperature ramp

Data compiled by: NIST Mass Spectrometry Data Center, William E. Wallace, director

Column type CapillaryCapillaryCapillary
Active phase Petrocol DHOV-101SE-54
Column length (m) 100.50.50.
Carrier gas HeliumHelium
Substrate
Column diameter (mm) 0.250.200.32
Phase thickness (μm) 0.500.50
Tstart (C) 20.30.60.
Tend (C) 220.100.200.
Heat rate (K/min) 15.1.4.
Initial hold (min) 15.6.2.
Final hold (min) 30.
I 839.834.843.
ReferenceSupelco, 2012Orav, Kailas, et al., 1999Guan, Li, et al., 1995
Comment MSDC-RI MSDC-RI MSDC-RI

Van Den Dool and Kratz RI, non-polar column, custom temperature program

Data compiled by: NIST Mass Spectrometry Data Center, William E. Wallace, director

Column type Capillary
Active phase OV-101
Column length (m)
Carrier gas
Substrate
Column diameter (mm)
Phase thickness (μm)
Program not specified
I 840.
ReferenceWu and Lu, 1984
Comment MSDC-RI

References

Haagen-Smit Laboratory, 1997
Haagen-Smit Laboratory, Procedure for the detailed hydrocarbon analysis of gasolines by single column high efficiency (capillary) column gas chromatography, SOP NO. MLD 118, Revision No. 1.1, California Environmental Protection Agency, Air Resources Board, El Monte, California, 1997, 22. [all data]