Thiophene, 2-ethyl-5-methyl-

Phase change data

Data compiled by: Thermodynamics Research Center, NIST Boulder Laboratories, Chris Muzny director

Quantity Value Units Method Reference Comment
Tboil433.3KN/AMidgley, Henne, et al., 1932Uncertainty assigned by TRC = 2. K
Tboil433.2KN/AMidgley, Henne, et al., 1932Uncertainty assigned by TRC = 1.5 K
Tboil433.3KN/AShepard, 1932Uncertainty assigned by TRC = 1.5 K
Quantity Value Units Method Reference Comment
Tfus199.0KN/AMidgley, Henne, et al., 1932Uncertainty assigned by TRC = 1. K
Tfus203.8KN/AMidgley, Henne, et al., 1932Uncertainty assigned by TRC = 1.5 K
Tfus204.7KN/AShepard, 1932Uncertainty assigned by TRC = 0.8 K

In addition to the Thermodynamics Research Center (TRC) data available from this site, much more physical and chemical property data is available from the following TRC products:

References

Midgley, Henne, et al., 1932
Midgley, T.; Henne, A.L.; Shepard, A.F., Natural and Synthetic Rubber IX. The Products of Destructive Distillation of Ebonite, J. Am. Chem. Soc., 1932, 54, 2857-60. [all data]

Shepard, 1932
Shepard, A.F., The Preparation and Properties of Some Substituted 2-Methylthiophenes, J. Am. Chem. Soc., 1932, 54, 2951. [all data]